{"text_format":"1","workbook":"xlsx","n_sheets":7,"sheets":["4°","4° ZF","Blad2","Blad3","databank","dataweb","LEDEN"],"not_rendered":{"charts":0,"images":0,"macros":0,"external_links":2,"defined_names":6,"comments":0,"pivot_tables":0},"unopened":[],"bounds":{"document_bytes":16777216,"sheet_cells":100000,"rows_first":2000,"rows_last":500,"rows_between":2000,"halvings":0,"cell_chars":16384,"cell_head_chars":4096},"cells_cut":0,"cells_raw":0,"read":"whole","date_system":"1900"}

{"sheet":"4°","index":0,"n_rows":66,"n_cols":32,"rows_kept":66,"cut":false,"hidden":false,"merged":[[60,1,60,11],[60,14,60,15],[60,16,60,17],[60,18,60,19],[60,20,60,21],[60,22,60,23],[60,24,60,25],[65,3,65,8],[58,1,58,2],[58,3,58,11],[58,14,58,15],[58,16,58,17],[58,18,58,19],[58,20,58,21],[58,22,58,23],[58,24,58,25],[59,1,59,2],[59,3,59,11],[59,14,59,15],[59,16,59,17],[59,18,59,19],[59,20,59,21],[59,22,59,23],[59,24,59,25],[56,1,56,2],[56,3,56,11],[56,14,56,15],[56,16,56,17],[56,18,56,19],[56,20,56,21],[56,22,56,23],[56,24,56,25],[57,1,57,2],[57,3,57,11],[57,14,57,15],[57,16,57,17],[57,18,57,19],[57,20,57,21],[57,22,57,23],[57,24,57,25],[53,1,53,11],[53,14,53,15],[53,16,53,17],[53,18,53,19],[53,20,53,21],[53,22,53,23],[53,24,53,25],[55,1,55,2],[55,3,55,11],[55,14,55,15],[55,16,55,17],[55,12,55,13],[51,1,51,2],[51,3,51,11],[51,14,51,15],[51,16,51,17],[51,18,51,19],[51,20,51,21],[51,22,51,23],[51,24,51,25],[52,1,52,2],[52,3,52,11],[52,14,52,15],[52,16,52,17],[52,18,52,19],[52,20,52,21],[52,22,52,23],[52,24,52,25],[49,20,49,21],[49,22,49,23],[49,24,49,25],[50,1,50,2],[50,3,50,11],[50,14,50,15],[50,16,50,17],[50,18,50,19],[50,20,50,21],[50,22,50,23],[50,24,50,25],[48,1,48,2],[48,3,48,11],[48,14,48,15],[48,16,48,17],[49,1,49,2],[49,3,49,11],[49,14,49,15],[49,16,49,17],[49,18,49,19],[48,12,48,13],[11,12,11,13],[4,0,4,26],[11,1,11,2],[9,3,9,11],[9,14,9,15],[9,16,9,17],[9,18,9,19],[9,20,9,21],[9,22,9,23],[9,1,9,2],[11,16,11,17],[9,12,9,13],[7,1,7,3],[6,22,6,23],[6,24,6,25],[7,22,7,23],[7,24,7,25],[6,16,6,17],[7,16,7,17],[11,14,11,15],[11,3,11,11],[11,18,11,19],[11,20,11,21],[11,22,11,23],[12,18,12,19],[13,18,13,19],[14,18,14,19],[15,18,15,19],[12,1,12,2],[14,1,14,2],[13,1,13,2],[15,1,15,2],[12,16,12,17],[13,16,13,17],[14,16,14,17],[15,16,15,17],[12,3,12,11],[13,3,13,11],[14,3,14,11],[15,3,15,11],[12,14,12,15],[13,14,13,15],[14,14,14,15],[15,14,15,15],[12,20,12,21],[13,20,13,21],[14,20,14,21],[15,20,15,21],[9,24,9,25],[12,22,12,23],[12,24,12,25],[13,22,13,23],[13,24,13,25],[11,24,11,25],[16,22,16,23],[16,24,16,25],[18,1,18,2],[18,3,18,11],[18,14,18,15],[18,16,18,17],[14,22,14,23],[14,24,14,25],[15,24,15,25],[15,22,15,23],[16,1,16,11],[16,14,16,15],[16,16,16,17],[16,18,16,19],[16,20,16,21],[18,12,18,13],[19,20,19,21],[19,22,19,23],[19,24,19,25],[20,1,20,2],[20,3,20,11],[20,14,20,15],[20,16,20,17],[20,18,20,19],[20,20,20,21],[19,1,19,2],[19,3,19,11],[19,14,19,15],[19,16,19,17],[19,18,19,19],[20,22,20,23],[20,24,20,25],[22,1,22,2],[22,3,22,11],[22,14,22,15],[22,16,22,17],[22,18,22,19],[22,20,22,21],[22,22,22,23],[22,24,22,25],[21,1,21,2],[21,3,21,11],[21,14,21,15],[21,16,21,17],[21,18,21,19],[21,20,21,21],[21,22,21,23],[21,24,21,25],[23,22,23,23],[23,24,23,25],[25,1,25,2],[25,3,25,11],[25,14,25,15],[25,16,25,17],[23,1,23,11],[23,14,23,15],[23,16,23,17],[23,18,23,19],[23,20,23,21],[25,12,25,13],[26,20,26,21],[26,22,26,23],[26,24,26,25],[27,1,27,2],[27,3,27,11],[27,14,27,15],[27,16,27,17],[27,18,27,19],[27,20,27,21],[26,1,26,2],[26,3,26,11],[26,14,26,15],[26,16,26,17],[26,18,26,19],[27,22,27,23],[27,24,27,25],[29,1,29,2],[29,3,29,11],[29,14,29,15],[29,16,29,17],[29,18,29,19],[29,20,29,21],[29,22,29,23],[29,24,29,25],[28,1,28,2],[28,3,28,11],[28,14,28,15],[28,16,28,17],[28,18,28,19],[28,20,28,21],[28,22,28,23],[28,24,28,25],[30,22,30,23],[30,24,30,25],[32,1,32,2],[32,3,32,11],[32,14,32,15],[32,16,32,17],[30,1,30,11],[30,14,30,15],[30,16,30,17],[30,18,30,19],[30,20,30,21],[32,12,32,13],[33,20,33,21],[33,22,33,23],[33,24,33,25],[34,1,34,2],[34,3,34,11],[34,14,34,15],[34,16,34,17],[34,18,34,19],[34,20,34,21],[33,1,33,2],[33,3,33,11],[33,14,33,15],[33,16,33,17],[33,18,33,19],[34,22,34,23],[34,24,34,25],[36,1,36,2],[36,3,36,11],[36,14,36,15],[36,16,36,17],[36,18,36,19],[36,20,36,21],[36,22,36,23],[36,24,36,25],[35,1,35,2],[35,3,35,11],[35,14,35,15],[35,16,35,17],[35,18,35,19],[35,20,35,21],[35,22,35,23],[35,24,35,25],[37,22,37,23],[37,24,37,25],[39,1,39,2],[39,3,39,11],[39,14,39,15],[39,16,39,17],[37,1,37,11],[37,14,37,15],[37,16,37,17],[37,18,37,19],[37,20,37,21],[39,12,39,13],[40,20,40,21],[40,22,40,23],[40,24,40,25],[41,1,41,2],[41,3,41,11],[41,14,41,15],[41,16,41,17],[41,18,41,19],[41,20,41,21],[40,1,40,2],[40,3,40,11],[40,14,40,15],[40,16,40,17],[40,18,40,19],[41,22,41,23],[41,24,41,25],[44,18,44,19],[44,20,44,21],[42,24,42,25],[43,1,43,2],[43,3,43,11],[43,14,43,15],[43,16,43,17],[43,18,43,19],[43,20,43,21],[43,22,43,23],[43,24,43,25],[42,1,42,2],[42,3,42,11],[42,14,42,15],[42,16,42,17],[42,18,42,19],[42,20,42,21],[42,22,42,23],[44,22,44,23],[44,24,44,25],[44,1,44,11],[44,14,44,15],[44,16,44,17]]}
["K O N I N K L I J K E   B E L G I S C H E    B I L J A R T B O N D ",null,null,null,null,null,null,null,null,null,null,null,null,"-","F E D E R A T I O N  R O Y A L E   B E L G E  DE  B I L L A R D "]
[null,null,null,null,null,"VZW - Zetel -  \" Marie Thérèse \" - Martelarenplein, 1  -  3000 Leuven"]
[null,null,null,null,"GEWEST  BEIDE  VLAANDEREN"]
[null,null,null,null,null,null,null,null,null,null,null,"2019 - 2020"]
["UITSLAG GEWESTFINALE   4°  :    KLASSE   VRIJSPEL MB "]
[]
[null,"Inrichting : ",null,null,"ACADEMIE CENTRUM GENT ",null,null,null,null,null,null,null,null,null,null,null,"TSP",null,null,null,null,null,"MIN",null,"MAX"]
[null,"datum  : ",null,null,"zondag, 3 november 2019",null,null,null,null,null,null,null,null,null,null,null,60,null,null,null,null,null,3,null,5]
[]
[null,"NATID",null,"NAAM ",null,null,null,null,null,null,null,null,"CLUB",null,"WEDP",null,"BP",null,"Beurten",null,"GEM",null,"HR",null,"OPM",null,"Pl"]
[]
[null,6428,null,{"$f":"VLOOKUP(B12,LEDEN!A:B,2,FALSE)","v":"MEULEMAN Rudy"},null,null,null,null,null,null,null,null,{"$f":"VLOOKUP(B12,LEDEN!A:C,3,FALSE)","v":"ACG"}]
[null,8672,null,{"$f":"VLOOKUP(B13,LEDEN!A:B,2,FALSE)","v":"DEMOOR Danny"},null,null,null,null,null,null,null,null,null,null,2,null,60,null,13,null,{"$f":"IF(S13=0,\" \",TRUNC(Q13/S13,2))","v":4.6100000000000003},null,22,null,{"$f":"IF(Q13=0,\"\",IF(U13>=AD13,\"PR\",IF(U13<AC13,\"OG\",\"MG\")))","v":"MG"},null,null,null,3,4.99]
[null,6713,null,{"$f":"VLOOKUP(B14,LEDEN!A:B,2,FALSE)","v":"VAN ACKER Johan"},null,null,null,null,null,null,null,null,null,null,2,null,60,null,13,null,{"$f":"IF(S14=0,\" \",TRUNC(Q14/S14,2))","v":4.6100000000000003},null,19,null,{"$f":"IF(Q14=0,\"\", IF(U14>=AD14,\"PR\",IF(U14<AC14,\"OG\",\"MG\")))","v":"MG"},null,null,null,3,4.99,null,"  "]
[null,7010,null,{"$f":"VLOOKUP(B15,LEDEN!A:B,2,FALSE)","v":"VERMEULEN Johan"},null,null,null,null,null,null,null,null,null,null,2,null,60,null,18,null,{"$f":"IF(S15=0,\" \",TRUNC(Q15/S15,2))","v":3.33},null,15,null,{"$f":"IF(Q15=0,\"\", IF(U15>=AD15,\"PR\",IF(U15<AC15,\"OG\",\"MG\")))","v":"MG"},null,null,null,3,4.99]
[null,null,null,{"$f":"VLOOKUP(B16,LEDEN!A:B,2,FALSE)","v":{"$error":"#N/A"}},null,null,null,null,null,null,null,null,null,null,null,null,null,null,null,null," ",null,null,null,null,null,null,null,3,4.99]
[null,"EINDRESULTAAT",null,null,null,null,null,null,null,null,null,null,null,null,{"$f":"SUM(O13:P16)","v":6},null,{"$f":"SUM(Q13:R16)","v":180},null,{"$f":"SUM(S13:T16)","v":44},null,{"$f":"IF(S17=0,\" \",TRUNC(Q17/S17,2))","v":4.09},null,{"$f":"MAX(W13:X16)","v":22},null,"MG",null,1]
[]
[null,8672,null,{"$f":"VLOOKUP(B19,LEDEN!A:B,2,FALSE)","v":"DEMOOR Danny"},null,null,null,null,null,null,null,null,{"$f":"VLOOKUP(B19,LEDEN!A:C,3,FALSE)","v":"ACG"}]
[null,6428,null,{"$f":"VLOOKUP(B20,LEDEN!A:B,2,FALSE)","v":"MEULEMAN Rudy"},null,null,null,null,null,null,null,null,null,null,0,null,23,null,13,null,{"$f":"IF(S20=0,\" \",TRUNC(Q20/S20,2))","v":1.76},null,6,null,{"$f":"IF(Q20=0,\"\", IF(U20>=AD20,\"PR\",IF(U20<AC20,\"OG\",\"MG\")))","v":"OG"},null,null,null,3,4.99]
[null,7010,null,{"$f":"VLOOKUP(B21,LEDEN!A:B,2,FALSE)","v":"VERMEULEN Johan"},null,null,null,null,null,null,null,null,null,null,2,null,60,null,7,null,{"$f":"IF(S21=0,\" \",TRUNC(Q21/S21,2))","v":8.57},null,38,null,{"$f":"IF(Q21=0,\"\", IF(U21>=AD21,\"PR\",IF(U21<AC21,\"OG\",\"MG\")))","v":"PR"},null,null,null,3,4.99]
[null,6713,null,{"$f":"VLOOKUP(B22,LEDEN!A:B,2,FALSE)","v":"VAN ACKER Johan"},null,null,null,null,null,null,null,null,null,null,2,null,60,null,23,null,2.6,null,15,null,{"$f":"IF(Q22=0,\"\", IF(U22>=AD22,\"PR\",IF(U22<AC22,\"OG\",\"MG\")))","v":"OG"},null,null,null,3,4.99]
[null,null,null,{"$f":"VLOOKUP(B23,LEDEN!A:B,2,FALSE)","v":{"$error":"#N/A"}},null,null,null,null,null,null,null,null,null,null,null,null,null,null,null,null," ",null,null,null,null,null,null,null,3,4.99]
[null,"EINDRESULTAAT",null,null,null,null,null,null,null,null,null,null,null,null,{"$f":"SUM(O20:P23)","v":4},null,{"$f":"SUM(Q20:R23)","v":143},null,{"$f":"SUM(S20:T23)","v":43},null,{"$f":"IF(S24=0,\" \",TRUNC(Q24/S24,2))","v":3.32},null,{"$f":"MAX(W20:X23)","v":38},null,"MG",null,2]
[]
[null,6713,null,{"$f":"VLOOKUP(B26,LEDEN!A:B,2,FALSE)","v":"VAN ACKER Johan"},null,null,null,null,null,null,null,null,{"$f":"VLOOKUP(B26,LEDEN!A:C,3,FALSE)","v":"KBCAW"}]
[null,7010,null,{"$f":"VLOOKUP(B27,LEDEN!A:B,2,FALSE)","v":"VERMEULEN Johan"},null,null,null,null,null,null,null,null,null,null,0,null,54,null,21,null,{"$f":"IF(S27=0,\" \",TRUNC(Q27/S27,2))","v":2.57},null,13,null,{"$f":"IF(Q27=0,\"\", IF(U27>=AD27,\"PR\",IF(U27<AC27,\"OG\",\"MG\")))","v":"OG"},null,null,null,3,4.99]
[null,6428,null,{"$f":"VLOOKUP(B28,LEDEN!A:B,2,FALSE)","v":"MEULEMAN Rudy"},null,null,null,null,null,null,null,null,null,null,0,null,16,null,13,null,{"$f":"IF(S28=0,\" \",TRUNC(Q28/S28,2))","v":1.23},null,9,null,{"$f":"IF(Q28=0,\"\", IF(U28>=AD28,\"PR\",IF(U28<AC28,\"OG\",\"MG\")))","v":"OG"},null,null,null,3,4.99]
[null,8672,null,{"$f":"VLOOKUP(B29,LEDEN!A:B,2,FALSE)","v":"DEMOOR Danny"},null,null,null,null,null,null,null,null,null,null,0,null,35,null,23,null,1.52,null,14,null,{"$f":"IF(Q29=0,\"\", IF(U29>=AD29,\"PR\",IF(U29<AC29,\"OG\",\"MG\")))","v":"OG"},null,null,null,3,4.99]
[null,null,null,{"$f":"VLOOKUP(B30,LEDEN!A:B,2,FALSE)","v":{"$error":"#N/A"}},null,null,null,null,null,null,null,null,null,null,null,null,null,null,null,null," ",null,null,null,null,null,null,null,3,4.99]
[null,"EINDRESULTAAT",null,null,null,null,null,null,null,null,null,null,null,null,{"$f":"SUM(O27:P30)","v":0},null,{"$f":"SUM(Q27:R30)","v":105},null,{"$f":"SUM(S27:T30)","v":57},null,{"$f":"IF(S31=0,\" \",TRUNC(Q31/S31,2))","v":1.84},null,{"$f":"MAX(W27:X30)","v":14},null,"OG",null,4]
[]
[null,7010,null,{"$f":"VLOOKUP(B33,LEDEN!A:B,2,FALSE)","v":"VERMEULEN Johan"},null,null,null,null,null,null,null,null,{"$f":"VLOOKUP(B33,LEDEN!A:C,3,FALSE)","v":"OS"}]
[null,6713,null,{"$f":"VLOOKUP(B34,LEDEN!A:B,2,FALSE)","v":"VAN ACKER Johan"},null,null,null,null,null,null,null,null,null,null,2,null,60,null,21,null,{"$f":"IF(S34=0,\" \",TRUNC(Q34/S34,2))","v":2.85},null,17,null,{"$f":"IF(Q34=0,\"\", IF(U34>=AD34,\"PR\",IF(U34<AC34,\"OG\",\"MG\")))","v":"OG"},null,null,null,3,4.99]
[null,8672,null,{"$f":"VLOOKUP(B35,LEDEN!A:B,2,FALSE)","v":"DEMOOR Danny"},null,null,null,null,null,null,null,null,null,null,0,null,36,null,7,null,{"$f":"IF(S35=0,\" \",TRUNC(Q35/S35,2))","v":5.14},null,10,null,{"$f":"IF(Q35=0,\"\", IF(U35>=AD35,\"PR\",IF(U35<AC35,\"OG\",\"MG\")))","v":"PR"},null,null,null,3,4.99]
[null,6428,null,{"$f":"VLOOKUP(B36,LEDEN!A:B,2,FALSE)","v":"MEULEMAN Rudy"},null,null,null,null,null,null,null,null,null,null,0,null,51,null,18,null,2.83,null,14,null,{"$f":"IF(Q36=0,\"\", IF(U36>=AD36,\"PR\",IF(U36<AC36,\"OG\",\"MG\")))","v":"OG"},null,null,null,3,4.99]
[null,null,null,{"$f":"VLOOKUP(B37,LEDEN!A:B,2,FALSE)","v":{"$error":"#N/A"}},null,null,null,null,null,null,null,null,null,null,null,null,null,null,null,null," ",null,null,null,null,null,null,null,3,4.99]
[null,"EINDRESULTAAT",null,null,null,null,null,null,null,null,null,null,null,null,{"$f":"SUM(O34:P37)","v":2},null,{"$f":"SUM(Q34:R37)","v":147},null,{"$f":"SUM(S34:T37)","v":46},null,{"$f":"IF(S38=0,\" \",TRUNC(Q38/S38,2))","v":3.19},null,{"$f":"MAX(W34:X37)","v":17},null,"MG",null,3]
[]
[null,null,null,{"$f":"VLOOKUP(B40,LEDEN!A:B,2,FALSE)","v":{"$error":"#N/A"}},null,null,null,null,null,null,null,null,{"$f":"VLOOKUP(B40,LEDEN!A:C,3,FALSE)","v":{"$error":"#N/A"}}]
[null,null,null,{"$f":"VLOOKUP(B41,LEDEN!A:B,2,FALSE)","v":{"$error":"#N/A"}},null,null,null,null,null,null,null,null,null,null,null,null,null,null,null,null,{"$f":"IF(S41=0,\" \",TRUNC(Q41/S41,2))","v":" "},null,null,null,{"$f":"IF(Q41=0,\"\", IF(U41>=AD41,\"PR\",IF(U41<AC41,\"OG\",\"MG\")))","v":""},null,null,null,3,4.99]
[null,null,null,{"$f":"VLOOKUP(B42,LEDEN!A:B,2,FALSE)","v":{"$error":"#N/A"}},null,null,null,null,null,null,null,null,null,null,null,null,null,null,null,null,{"$f":"IF(S42=0,\" \",TRUNC(Q42/S42,2))","v":" "},null,null,null,{"$f":"IF(Q42=0,\"\", IF(U42>=AD42,\"PR\",IF(U42<AC42,\"OG\",\"MG\")))","v":""},null,null,null,3,4.99]
[null,null,null,{"$f":"VLOOKUP(B43,LEDEN!A:B,2,FALSE)","v":{"$error":"#N/A"}},null,null,null,null,null,null,null,null,null,null,null,null,null,null,null,null," ",null,null,null,{"$f":"IF(Q43=0,\"\", IF(U43>=AD43,\"PR\",IF(U43<AC43,\"OG\",\"MG\")))","v":""},null,null,null,3,4.99]
[null,null,null,{"$f":"VLOOKUP(B44,LEDEN!A:B,2,FALSE)","v":{"$error":"#N/A"}},null,null,null,null,null,null,null,null,null,null,null,null,null,null,null,null," ",null,null,null,null,null,null,null,3,4.99]
[null,"EINDRESULTAAT",null,null,null,null,null,null,null,null,null,null,null,null,{"$f":"SUM(O41:P44)","v":0},null,{"$f":"SUM(Q41:R44)","v":0},null,{"$f":"SUM(S41:T44)","v":0},null,{"$f":"IF(S45=0,\" \",TRUNC(Q45/S45,2))","v":" "},null,{"$f":"MAX(W41:X44)","v":0}]
[]
[]
[]
[null,null,null,{"$f":"VLOOKUP(B49,LEDEN!A:B,2,FALSE)","v":{"$error":"#N/A"}},null,null,null,null,null,null,null,null,{"$f":"VLOOKUP(B49,LEDEN!A:C,3,FALSE)","v":{"$error":"#N/A"}}]
[null,null,null,{"$f":"VLOOKUP(B50,LEDEN!A:B,2,FALSE)","v":{"$error":"#N/A"}},null,null,null,null,null,null,null,null,null,null,null,null,null,null,null,null,{"$f":"IF(S50=0,\" \",TRUNC(Q50/S50,2))","v":" "},null,null,null,{"$f":"IF(Q50=0,\"\", IF(U50>=AD50,\"PR\",IF(U50<AC50,\"OG\",\"MG\")))","v":""},null,null,null,3,4.99]
[null,null,null,{"$f":"VLOOKUP(B51,LEDEN!A:B,2,FALSE)","v":{"$error":"#N/A"}},null,null,null,null,null,null,null,null,null,null,null,null,null,null,null,null,{"$f":"IF(S51=0,\" \",TRUNC(Q51/S51,2))","v":" "},null,null,null,{"$f":"IF(Q51=0,\"\", IF(U51>=AD51,\"PR\",IF(U51<AC51,\"OG\",\"MG\")))","v":""},null,null,null,3,4.99]
[null,null,null,{"$f":"VLOOKUP(B52,LEDEN!A:B,2,FALSE)","v":{"$error":"#N/A"}},null,null,null,null,null,null,null,null,null,null,null,null,null,null,null,null," ",null,null,null,{"$f":"IF(Q52=0,\"\", IF(U52>=AD52,\"PR\",IF(U52<AC52,\"OG\",\"MG\")))","v":""},null,null,null,3,4.99]
[null,null,null,{"$f":"VLOOKUP(B53,LEDEN!A:B,2,FALSE)","v":{"$error":"#N/A"}},null,null,null,null,null,null,null,null,null,null,null,null,null,null,null,null," ",null,null,null,null,null,null,null,3,4.99]
[null,"EINDRESULTAAT",null,null,null,null,null,null,null,null,null,null,null,null,{"$f":"SUM(O50:P53)","v":0},null,{"$f":"SUM(Q50:R53)","v":0},null,{"$f":"SUM(S50:T53)","v":0},null,{"$f":"IF(S54=0,\" \",TRUNC(Q54/S54,2))","v":" "},null,{"$f":"MAX(W50:X53)","v":0}]
[]
[null,null,null,{"$f":"VLOOKUP(B56,LEDEN!A:B,2,FALSE)","v":{"$error":"#N/A"}},null,null,null,null,null,null,null,null,{"$f":"VLOOKUP(B56,LEDEN!A:C,3,FALSE)","v":{"$error":"#N/A"}}]
[null,null,null,{"$f":"VLOOKUP(B57,LEDEN!A:B,2,FALSE)","v":{"$error":"#N/A"}},null,null,null,null,null,null,null,null,null,null,null,null,null,null,null,null,{"$f":"IF(S57=0,\" \",TRUNC(Q57/S57,2))","v":" "},null,null,null,{"$f":"IF(Q57=0,\"\", IF(U57>=AD57,\"PR\",IF(U57<AC57,\"OG\",\"MG\")))","v":""},null,null,null,3,4.99]
[null,null,null,{"$f":"VLOOKUP(B58,LEDEN!A:B,2,FALSE)","v":{"$error":"#N/A"}},null,null,null,null,null,null,null,null,null,null,null,null,null,null,null,null,{"$f":"IF(S58=0,\" \",TRUNC(Q58/S58,2))","v":" "},null,null,null,{"$f":"IF(Q58=0,\"\", IF(U58>=AD58,\"PR\",IF(U58<AC58,\"OG\",\"MG\")))","v":""},null,null,null,3,4.99]
[null,null,null,{"$f":"VLOOKUP(B59,LEDEN!A:B,2,FALSE)","v":{"$error":"#N/A"}},null,null,null,null,null,null,null,null,null,null,null,null,null,null,null,null," ",null,null,null,{"$f":"IF(Q59=0,\"\", IF(U59>=AD59,\"PR\",IF(U59<AC59,\"OG\",\"MG\")))","v":""},null,null,null,3,4.99]
[null,null,null,{"$f":"VLOOKUP(B60,LEDEN!A:B,2,FALSE)","v":{"$error":"#N/A"}},null,null,null,null,null,null,null,null,null,null,null,null,null,null,null,null," ",null,null,null,null,null,null,null,3,4.99]
[null,"EINDRESULTAAT",null,null,null,null,null,null,null,null,null,null,null,null,{"$f":"SUM(O57:P60)","v":0},null,{"$f":"SUM(Q57:R60)","v":0},null,{"$f":"SUM(S57:T60)","v":0},null,{"$f":"IF(S61=0,\" \",TRUNC(Q61/S61,2))","v":" "},null,{"$f":"MAX(W57:X60)","v":0}]
[]
[]
[]
[]
[null,null,null,{"$f":"TODAY()","v":"2019-11-04"},null,null,null,null,null,null,null,null,null,null,null,null,null,null,"Verantwoordelijke "]

{"sheet":"4° ZF","index":1,"n_rows":66,"n_cols":32,"rows_kept":66,"cut":false,"hidden":false,"merged":[[60,24,60,25],[65,3,65,8],[11,18,11,19],[11,20,11,21],[11,22,11,23],[11,24,11,25],[60,1,60,11],[60,14,60,15],[60,16,60,17],[60,18,60,19],[60,20,60,21],[60,22,60,23],[58,22,58,23],[58,24,58,25],[59,1,59,2],[59,3,59,11],[59,14,59,15],[59,16,59,17],[59,18,59,19],[59,20,59,21],[59,22,59,23],[59,24,59,25],[58,1,58,2],[58,3,58,11],[58,14,58,15],[58,16,58,17],[58,18,58,19],[58,20,58,21],[56,22,56,23],[56,24,56,25],[57,1,57,2],[57,3,57,11],[57,14,57,15],[57,16,57,17],[57,18,57,19],[57,20,57,21],[57,22,57,23],[57,24,57,25],[56,1,56,2],[56,3,56,11],[56,14,56,15],[56,16,56,17],[56,18,56,19],[56,20,56,21],[53,24,53,25],[55,1,55,2],[55,3,55,11],[55,12,55,13],[55,14,55,15],[55,16,55,17],[53,1,53,11],[53,14,53,15],[53,16,53,17],[53,18,53,19],[53,20,53,21],[53,22,53,23],[51,22,51,23],[51,24,51,25],[52,1,52,2],[52,3,52,11],[52,14,52,15],[52,16,52,17],[52,18,52,19],[52,20,52,21],[52,22,52,23],[52,24,52,25],[51,1,51,2],[51,3,51,11],[51,14,51,15],[51,16,51,17],[51,18,51,19],[51,20,51,21],[49,22,49,23],[49,24,49,25],[50,1,50,2],[50,3,50,11],[50,14,50,15],[50,16,50,17],[50,18,50,19],[50,20,50,21],[50,22,50,23],[50,24,50,25],[49,1,49,2],[49,3,49,11],[49,14,49,15],[49,16,49,17],[49,18,49,19],[49,20,49,21],[44,24,44,25],[48,1,48,2],[48,3,48,11],[48,12,48,13],[48,14,48,15],[48,16,48,17],[44,1,44,11],[44,14,44,15],[44,16,44,17],[44,18,44,19],[44,20,44,21],[44,22,44,23],[42,22,42,23],[42,24,42,25],[43,1,43,2],[43,3,43,11],[43,14,43,15],[43,16,43,17],[43,18,43,19],[43,20,43,21],[43,22,43,23],[43,24,43,25],[42,1,42,2],[42,3,42,11],[42,14,42,15],[42,16,42,17],[42,18,42,19],[42,20,42,21],[40,22,40,23],[40,24,40,25],[41,1,41,2],[41,3,41,11],[41,14,41,15],[41,16,41,17],[41,18,41,19],[41,20,41,21],[41,22,41,23],[41,24,41,25],[40,1,40,2],[40,3,40,11],[40,14,40,15],[40,16,40,17],[40,18,40,19],[40,20,40,21],[37,24,37,25],[39,1,39,2],[39,3,39,11],[39,12,39,13],[39,14,39,15],[39,16,39,17],[37,1,37,11],[37,14,37,15],[37,16,37,17],[37,18,37,19],[37,20,37,21],[37,22,37,23],[35,22,35,23],[35,24,35,25],[36,1,36,2],[36,3,36,11],[36,14,36,15],[36,16,36,17],[36,18,36,19],[36,20,36,21],[36,22,36,23],[36,24,36,25],[35,1,35,2],[35,3,35,11],[35,14,35,15],[35,16,35,17],[35,18,35,19],[35,20,35,21],[33,22,33,23],[33,24,33,25],[34,1,34,2],[34,3,34,11],[34,14,34,15],[34,16,34,17],[34,18,34,19],[34,20,34,21],[34,22,34,23],[34,24,34,25],[33,1,33,2],[33,3,33,11],[33,14,33,15],[33,16,33,17],[33,18,33,19],[33,20,33,21],[30,24,30,25],[32,1,32,2],[32,3,32,11],[32,12,32,13],[32,14,32,15],[32,16,32,17],[30,1,30,11],[30,14,30,15],[30,16,30,17],[30,18,30,19],[30,20,30,21],[30,22,30,23],[28,22,28,23],[28,24,28,25],[29,1,29,2],[29,3,29,11],[29,14,29,15],[29,16,29,17],[29,18,29,19],[29,20,29,21],[29,22,29,23],[29,24,29,25],[28,1,28,2],[28,3,28,11],[28,14,28,15],[28,16,28,17],[28,18,28,19],[28,20,28,21],[26,22,26,23],[26,24,26,25],[27,1,27,2],[27,3,27,11],[27,14,27,15],[27,16,27,17],[27,18,27,19],[27,20,27,21],[27,22,27,23],[27,24,27,25],[26,1,26,2],[26,3,26,11],[26,14,26,15],[26,16,26,17],[26,18,26,19],[26,20,26,21],[23,24,23,25],[25,1,25,2],[25,3,25,11],[25,12,25,13],[25,14,25,15],[25,16,25,17],[23,1,23,11],[23,14,23,15],[23,16,23,17],[23,18,23,19],[23,20,23,21],[23,22,23,23],[21,22,21,23],[21,24,21,25],[22,1,22,2],[22,3,22,11],[22,14,22,15],[22,16,22,17],[22,18,22,19],[22,20,22,21],[22,22,22,23],[22,24,22,25],[21,1,21,2],[21,3,21,11],[21,14,21,15],[21,16,21,17],[21,18,21,19],[21,20,21,21],[19,22,19,23],[19,24,19,25],[20,1,20,2],[20,3,20,11],[20,14,20,15],[20,16,20,17],[20,18,20,19],[20,20,20,21],[20,22,20,23],[20,24,20,25],[19,1,19,2],[19,3,19,11],[19,14,19,15],[19,16,19,17],[19,18,19,19],[19,20,19,21],[16,24,16,25],[18,1,18,2],[18,3,18,11],[18,12,18,13],[18,14,18,15],[18,16,18,17],[16,1,16,11],[16,14,16,15],[16,16,16,17],[16,18,16,19],[16,20,16,21],[16,22,16,23],[14,22,14,23],[14,24,14,25],[15,1,15,2],[15,3,15,11],[15,14,15,15],[15,16,15,17],[15,18,15,19],[15,20,15,21],[15,22,15,23],[15,24,15,25],[14,1,14,2],[14,3,14,11],[14,14,14,15],[14,16,14,17],[14,18,14,19],[14,20,14,21],[12,22,12,23],[12,24,12,25],[13,1,13,2],[13,3,13,11],[13,14,13,15],[13,16,13,17],[13,18,13,19],[13,20,13,21],[13,22,13,23],[13,24,13,25],[12,1,12,2],[12,3,12,11],[12,14,12,15],[12,16,12,17],[12,18,12,19],[12,20,12,21],[11,1,11,2],[11,3,11,11],[11,12,11,13],[11,14,11,15],[11,16,11,17],[9,1,9,2],[9,3,9,11],[9,12,9,13],[9,14,9,15],[9,16,9,17],[4,0,4,26],[6,16,6,17],[6,22,6,23],[6,24,6,25],[7,1,7,3],[7,16,7,17],[7,22,7,23],[7,24,7,25],[9,20,9,21],[9,22,9,23],[9,24,9,25],[9,18,9,19]]}
["K O N I N K L I J K E   B E L G I S C H E    B I L J A R T B O N D ",null,null,null,null,null,null,null,null,null,null,null,null,"-","F E D E R A T I O N  R O Y A L E   B E L G E  DE  B I L L A R D "]
[null,null,null,null,null,"VZW - Zetel -  \" Marie Thérèse \" - Martelarenplein, 1  -  3000 Leuven"]
[null,null,null,null,"GEWEST  BEIDE  VLAANDEREN"]
[null,null,null,null,null,null,null,null,null,null,null,"2019 - 2020"]
["UITSLAG GEWESTFINALE   4°  :    KLASSE   VRIJSPEL MB "]
[]
[null,"Inrichting : ",null,null,"ACADEMIE CENTRUM GENT ",null,null,null,null,null,null,null,null,null,null,null,"TSP",null,null,null,null,null,"MIN",null,"MAX"]
[null,"datum  : ",null,null,"zondag, 3 november 2019",null,null,null,null,null,null,null,null,null,null,null,60,null,null,null,null,null,3,null,5]
[]
[null,"NATID",null,"NAAM ",null,null,null,null,null,null,null,null,"CLUB",null,"WEDP",null,"BP",null,"Beurten",null,"GEM",null,"HR",null,"OPM",null,"Pl"]
[]
[null,6428,null,{"$f":"VLOOKUP(B12,LEDEN!A:B,2,FALSE)","v":"MEULEMAN Rudy"},null,null,null,null,null,null,null,null,{"$f":"VLOOKUP(B12,LEDEN!A:C,3,FALSE)","v":"ACG"}]
[null,8672,null,{"$f":"VLOOKUP(B13,LEDEN!A:B,2,FALSE)","v":"DEMOOR Danny"},null,null,null,null,null,null,null,null,null,null,null,null,null,null,null,null,{"$f":"IF(S13=0,\" \",TRUNC(Q13/S13,2))","v":" "},null,null,null,{"$f":"IF(Q13=0,\"\",IF(U13>=AD13,\"PR\",IF(U13<AC13,\"OG\",\"MG\")))","v":""},null,null,null,3,4.99]
[null,null,null,null,null,null,null,null,null,null,null,null,null,null,null,null,null,null,null,null,{"$f":"IF(S14=0,\" \",TRUNC(Q14/S14,2))","v":" "},null,null,null,{"$f":"IF(Q14=0,\"\", IF(U14>=AD14,\"PR\",IF(U14<AC14,\"OG\",\"MG\")))","v":""},null,null,null,3,4.99,null,"  "]
[null,null,null,null,null,null,null,null,null,null,null,null,null,null,null,null,null,null,null,null," ",null,null,null,{"$f":"IF(Q15=0,\"\", IF(U15>=AD15,\"PR\",IF(U15<AC15,\"OG\",\"MG\")))","v":""},null,null,null,3,4.99]
[null,null,null,{"$f":"VLOOKUP(B16,LEDEN!A:B,2,FALSE)","v":{"$error":"#N/A"}},null,null,null,null,null,null,null,null,null,null,null,null,null,null,null,null," ",null,null,null,null,null,null,null,3,4.99]
[null,"EINDRESULTAAT"]
[]
[null,8672,null,{"$f":"VLOOKUP(B19,LEDEN!A:B,2,FALSE)","v":"DEMOOR Danny"},null,null,null,null,null,null,null,null,{"$f":"VLOOKUP(B19,LEDEN!A:C,3,FALSE)","v":"ACG"}]
[null,8672,null,{"$f":"VLOOKUP(B20,LEDEN!A:B,2,FALSE)","v":"DEMOOR Danny"},null,null,null,null,null,null,null,null,null,null,null,null,null,null,null,null,{"$f":"IF(S20=0,\" \",TRUNC(Q20/S20,2))","v":" "},null,null,null,{"$f":"IF(Q20=0,\"\", IF(U20>=AD20,\"PR\",IF(U20<AC20,\"OG\",\"MG\")))","v":""},null,null,null,3,4.99]
[null,null,null,{"$f":"VLOOKUP(B21,LEDEN!A:B,2,FALSE)","v":{"$error":"#N/A"}},null,null,null,null,null,null,null,null,null,null,null,null,null,null,null,null,{"$f":"IF(S21=0,\" \",TRUNC(Q21/S21,2))","v":" "},null,null,null,{"$f":"IF(Q21=0,\"\", IF(U21>=AD21,\"PR\",IF(U21<AC21,\"OG\",\"MG\")))","v":""},null,null,null,3,4.99]
[null,null,null,{"$f":"VLOOKUP(B22,LEDEN!A:B,2,FALSE)","v":{"$error":"#N/A"}},null,null,null,null,null,null,null,null,null,null,null,null,null,null,null,null," ",null,null,null,{"$f":"IF(Q22=0,\"\", IF(U22>=AD22,\"PR\",IF(U22<AC22,\"OG\",\"MG\")))","v":""},null,null,null,3,4.99]
[null,null,null,{"$f":"VLOOKUP(B23,LEDEN!A:B,2,FALSE)","v":{"$error":"#N/A"}},null,null,null,null,null,null,null,null,null,null,null,null,null,null,null,null," ",null,null,null,null,null,null,null,3,4.99]
[null,"EINDRESULTAAT"]
[]
[null,6713,null,{"$f":"VLOOKUP(B26,LEDEN!A:B,2,FALSE)","v":"VAN ACKER Johan"},null,null,null,null,null,null,null,null,{"$f":"VLOOKUP(B26,LEDEN!A:C,3,FALSE)","v":"KBCAW"}]
[null,7010,null,{"$f":"VLOOKUP(B27,LEDEN!A:B,2,FALSE)","v":"VERMEULEN Johan"},null,null,null,null,null,null,null,null,null,null,null,null,null,null,null,null,{"$f":"IF(S27=0,\" \",TRUNC(Q27/S27,2))","v":" "},null,null,null,{"$f":"IF(Q27=0,\"\", IF(U27>=AD27,\"PR\",IF(U27<AC27,\"OG\",\"MG\")))","v":""},null,null,null,3,4.99]
[null,null,null,{"$f":"VLOOKUP(B28,LEDEN!A:B,2,FALSE)","v":{"$error":"#N/A"}},null,null,null,null,null,null,null,null,null,null,null,null,null,null,null,null,{"$f":"IF(S28=0,\" \",TRUNC(Q28/S28,2))","v":" "},null,null,null,{"$f":"IF(Q28=0,\"\", IF(U28>=AD28,\"PR\",IF(U28<AC28,\"OG\",\"MG\")))","v":""},null,null,null,3,4.99]
[null,null,null,{"$f":"VLOOKUP(B29,LEDEN!A:B,2,FALSE)","v":{"$error":"#N/A"}},null,null,null,null,null,null,null,null,null,null,null,null,null,null,null,null," ",null,null,null,{"$f":"IF(Q29=0,\"\", IF(U29>=AD29,\"PR\",IF(U29<AC29,\"OG\",\"MG\")))","v":""},null,null,null,3,4.99]
[null,null,null,{"$f":"VLOOKUP(B30,LEDEN!A:B,2,FALSE)","v":{"$error":"#N/A"}},null,null,null,null,null,null,null,null,null,null,null,null,null,null,null,null," ",null,null,null,null,null,null,null,3,4.99]
[null,"EINDRESULTAAT"]
[]
[null,7010,null,{"$f":"VLOOKUP(B33,LEDEN!A:B,2,FALSE)","v":"VERMEULEN Johan"},null,null,null,null,null,null,null,null,{"$f":"VLOOKUP(B33,LEDEN!A:C,3,FALSE)","v":"OS"}]
[null,6713,null,{"$f":"VLOOKUP(B34,LEDEN!A:B,2,FALSE)","v":"VAN ACKER Johan"},null,null,null,null,null,null,null,null,null,null,null,null,null,null,null,null,{"$f":"IF(S34=0,\" \",TRUNC(Q34/S34,2))","v":" "},null,null,null,{"$f":"IF(Q34=0,\"\", IF(U34>=AD34,\"PR\",IF(U34<AC34,\"OG\",\"MG\")))","v":""},null,null,null,3,4.99]
[null,null,null,null,null,null,null,null,null,null,null,null,null,null,null,null,null,null,null,null,{"$f":"IF(S35=0,\" \",TRUNC(Q35/S35,2))","v":" "},null,null,null,{"$f":"IF(Q35=0,\"\", IF(U35>=AD35,\"PR\",IF(U35<AC35,\"OG\",\"MG\")))","v":""},null,null,null,3,4.99]
[null,null,null,null,null,null,null,null,null,null,null,null,null,null,null,null,null,null,null,null," ",null,null,null,{"$f":"IF(Q36=0,\"\", IF(U36>=AD36,\"PR\",IF(U36<AC36,\"OG\",\"MG\")))","v":""},null,null,null,3,4.99]
[null,null,null,{"$f":"VLOOKUP(B37,LEDEN!A:B,2,FALSE)","v":{"$error":"#N/A"}},null,null,null,null,null,null,null,null,null,null,null,null,null,null,null,null," ",null,null,null,null,null,null,null,3,4.99]
[null,"EINDRESULTAAT"]
[]
[null,null,null,{"$f":"VLOOKUP(B40,LEDEN!A:B,2,FALSE)","v":{"$error":"#N/A"}},null,null,null,null,null,null,null,null,{"$f":"VLOOKUP(B40,LEDEN!A:C,3,FALSE)","v":{"$error":"#N/A"}}]
[null,null,null,{"$f":"VLOOKUP(B41,LEDEN!A:B,2,FALSE)","v":{"$error":"#N/A"}},null,null,null,null,null,null,null,null,null,null,null,null,null,null,null,null,{"$f":"IF(S41=0,\" \",TRUNC(Q41/S41,2))","v":" "},null,null,null,{"$f":"IF(Q41=0,\"\", IF(U41>=AD41,\"PR\",IF(U41<AC41,\"OG\",\"MG\")))","v":""},null,null,null,3,4.99]
[null,null,null,{"$f":"VLOOKUP(B42,LEDEN!A:B,2,FALSE)","v":{"$error":"#N/A"}},null,null,null,null,null,null,null,null,null,null,null,null,null,null,null,null,{"$f":"IF(S42=0,\" \",TRUNC(Q42/S42,2))","v":" "},null,null,null,{"$f":"IF(Q42=0,\"\", IF(U42>=AD42,\"PR\",IF(U42<AC42,\"OG\",\"MG\")))","v":""},null,null,null,3,4.99]
[null,null,null,{"$f":"VLOOKUP(B43,LEDEN!A:B,2,FALSE)","v":{"$error":"#N/A"}},null,null,null,null,null,null,null,null,null,null,null,null,null,null,null,null," ",null,null,null,{"$f":"IF(Q43=0,\"\", IF(U43>=AD43,\"PR\",IF(U43<AC43,\"OG\",\"MG\")))","v":""},null,null,null,3,4.99]
[null,null,null,{"$f":"VLOOKUP(B44,LEDEN!A:B,2,FALSE)","v":{"$error":"#N/A"}},null,null,null,null,null,null,null,null,null,null,null,null,null,null,null,null," ",null,null,null,null,null,null,null,3,4.99]
[null,"EINDRESULTAAT",null,null,null,null,null,null,null,null,null,null,null,null,{"$f":"SUM(O41:P44)","v":0},null,{"$f":"SUM(Q41:R44)","v":0},null,{"$f":"SUM(S41:T44)","v":0},null,{"$f":"IF(S45=0,\" \",TRUNC(Q45/S45,2))","v":" "},null,{"$f":"MAX(W41:X44)","v":0}]
[]
[]
[]
[null,null,null,{"$f":"VLOOKUP(B49,LEDEN!A:B,2,FALSE)","v":{"$error":"#N/A"}},null,null,null,null,null,null,null,null,{"$f":"VLOOKUP(B49,LEDEN!A:C,3,FALSE)","v":{"$error":"#N/A"}}]
[null,null,null,{"$f":"VLOOKUP(B50,LEDEN!A:B,2,FALSE)","v":{"$error":"#N/A"}},null,null,null,null,null,null,null,null,null,null,null,null,null,null,null,null,{"$f":"IF(S50=0,\" \",TRUNC(Q50/S50,2))","v":" "},null,null,null,{"$f":"IF(Q50=0,\"\", IF(U50>=AD50,\"PR\",IF(U50<AC50,\"OG\",\"MG\")))","v":""},null,null,null,3,4.99]
[null,null,null,{"$f":"VLOOKUP(B51,LEDEN!A:B,2,FALSE)","v":{"$error":"#N/A"}},null,null,null,null,null,null,null,null,null,null,null,null,null,null,null,null,{"$f":"IF(S51=0,\" \",TRUNC(Q51/S51,2))","v":" "},null,null,null,{"$f":"IF(Q51=0,\"\", IF(U51>=AD51,\"PR\",IF(U51<AC51,\"OG\",\"MG\")))","v":""},null,null,null,3,4.99]
[null,null,null,{"$f":"VLOOKUP(B52,LEDEN!A:B,2,FALSE)","v":{"$error":"#N/A"}},null,null,null,null,null,null,null,null,null,null,null,null,null,null,null,null," ",null,null,null,{"$f":"IF(Q52=0,\"\", IF(U52>=AD52,\"PR\",IF(U52<AC52,\"OG\",\"MG\")))","v":""},null,null,null,3,4.99]
[null,null,null,{"$f":"VLOOKUP(B53,LEDEN!A:B,2,FALSE)","v":{"$error":"#N/A"}},null,null,null,null,null,null,null,null,null,null,null,null,null,null,null,null," ",null,null,null,null,null,null,null,3,4.99]
[null,"EINDRESULTAAT",null,null,null,null,null,null,null,null,null,null,null,null,{"$f":"SUM(O50:P53)","v":0},null,{"$f":"SUM(Q50:R53)","v":0},null,{"$f":"SUM(S50:T53)","v":0},null,{"$f":"IF(S54=0,\" \",TRUNC(Q54/S54,2))","v":" "},null,{"$f":"MAX(W50:X53)","v":0}]
[]
[null,null,null,{"$f":"VLOOKUP(B56,LEDEN!A:B,2,FALSE)","v":{"$error":"#N/A"}},null,null,null,null,null,null,null,null,{"$f":"VLOOKUP(B56,LEDEN!A:C,3,FALSE)","v":{"$error":"#N/A"}}]
[null,null,null,{"$f":"VLOOKUP(B57,LEDEN!A:B,2,FALSE)","v":{"$error":"#N/A"}},null,null,null,null,null,null,null,null,null,null,null,null,null,null,null,null,{"$f":"IF(S57=0,\" \",TRUNC(Q57/S57,2))","v":" "},null,null,null,{"$f":"IF(Q57=0,\"\", IF(U57>=AD57,\"PR\",IF(U57<AC57,\"OG\",\"MG\")))","v":""},null,null,null,3,4.99]
[null,null,null,{"$f":"VLOOKUP(B58,LEDEN!A:B,2,FALSE)","v":{"$error":"#N/A"}},null,null,null,null,null,null,null,null,null,null,null,null,null,null,null,null,{"$f":"IF(S58=0,\" \",TRUNC(Q58/S58,2))","v":" "},null,null,null,{"$f":"IF(Q58=0,\"\", IF(U58>=AD58,\"PR\",IF(U58<AC58,\"OG\",\"MG\")))","v":""},null,null,null,3,4.99]
[null,null,null,{"$f":"VLOOKUP(B59,LEDEN!A:B,2,FALSE)","v":{"$error":"#N/A"}},null,null,null,null,null,null,null,null,null,null,null,null,null,null,null,null," ",null,null,null,{"$f":"IF(Q59=0,\"\", IF(U59>=AD59,\"PR\",IF(U59<AC59,\"OG\",\"MG\")))","v":""},null,null,null,3,4.99]
[null,null,null,{"$f":"VLOOKUP(B60,LEDEN!A:B,2,FALSE)","v":{"$error":"#N/A"}},null,null,null,null,null,null,null,null,null,null,null,null,null,null,null,null," ",null,null,null,null,null,null,null,3,4.99]
[null,"EINDRESULTAAT",null,null,null,null,null,null,null,null,null,null,null,null,{"$f":"SUM(O57:P60)","v":0},null,{"$f":"SUM(Q57:R60)","v":0},null,{"$f":"SUM(S57:T60)","v":0},null,{"$f":"IF(S61=0,\" \",TRUNC(Q61/S61,2))","v":" "},null,{"$f":"MAX(W57:X60)","v":0}]
[]
[]
[]
[]
[null,null,null,{"$f":"TODAY()","v":"2019-11-04"},null,null,null,null,null,null,null,null,null,null,null,null,null,null,"Verantwoordelijke "]

{"sheet":"Blad2","index":2,"n_rows":0,"n_cols":0,"rows_kept":0,"cut":false,"hidden":false,"merged":[]}

{"sheet":"Blad3","index":3,"n_rows":0,"n_cols":0,"rows_kept":0,"cut":false,"hidden":false,"merged":[]}

{"sheet":"databank","index":4,"n_rows":21,"n_cols":10,"rows_kept":21,"cut":false,"hidden":false,"merged":[]}
["competitie","NATID","CODESPORTJAAR","CODESOORT","CODECAT","CODEOPM","CODEDISCIPLINE","CODEFORMAAT","GEM","NCAT"]
[null,{"$f":"[2]Blad2!B1","v":0},24,{"$f":"[2]Blad2!E1","v":5},{"$f":"[2]Blad2!F1","v":5},{"$f":"[2]Blad2!H1","v":{"$error":"#DIV/0!"}},{"$f":"[2]Blad2!I1","v":1},2,{"$f":"[2]Blad2!K1","v":{"$error":"#DIV/0!"}},{"$f":"[2]Blad2!L1","v":{"$error":"#DIV/0!"}}]
["GWVOORRONDE",{"$f":"[2]Blad2!B2","v":0},24,{"$f":"[2]Blad2!E2","v":5},{"$f":"[2]Blad2!F2","v":5},{"$f":"[2]Blad2!H2","v":{"$error":"#DIV/0!"}},{"$f":"[2]Blad2!I2","v":1},2,{"$f":"[2]Blad2!K2","v":{"$error":"#DIV/0!"}},{"$f":"[2]Blad2!L2","v":{"$error":"#DIV/0!"}}]
["GWVOORRONDE",{"$f":"[2]Blad2!B3","v":0},24,{"$f":"[2]Blad2!E3","v":5},{"$f":"[2]Blad2!F3","v":5},{"$f":"[2]Blad2!H3","v":{"$error":"#DIV/0!"}},{"$f":"[2]Blad2!I3","v":1},2,{"$f":"[2]Blad2!K3","v":{"$error":"#DIV/0!"}},{"$f":"[2]Blad2!L3","v":{"$error":"#DIV/0!"}}]
["GWVOORRONDE",{"$f":"[2]Blad2!B4","v":0},24,{"$f":"[2]Blad2!E4","v":5},{"$f":"[2]Blad2!F4","v":5},{"$f":"[2]Blad2!H4","v":{"$error":"#DIV/0!"}},{"$f":"[2]Blad2!I4","v":1},2,{"$f":"[2]Blad2!K4","v":{"$error":"#DIV/0!"}},{"$f":"[2]Blad2!L4","v":{"$error":"#DIV/0!"}}]
["GWVOORRONDE",{"$f":"[2]Blad2!B5","v":0},24,{"$f":"[2]Blad2!E5","v":5},{"$f":"[2]Blad2!F5","v":5},{"$f":"[2]Blad2!H5","v":{"$error":"#DIV/0!"}},{"$f":"[2]Blad2!I5","v":1},2,{"$f":"[2]Blad2!K5","v":{"$error":"#DIV/0!"}},{"$f":"[2]Blad2!L5","v":{"$error":"#DIV/0!"}}]
["GWVOORRONDE",{"$f":"[2]Blad2!B6","v":0},24,{"$f":"[2]Blad2!E6","v":5},{"$f":"[2]Blad2!F6","v":5},{"$f":"[2]Blad2!H6","v":{"$error":"#DIV/0!"}},{"$f":"[2]Blad2!I6","v":1},2,{"$f":"[2]Blad2!K6","v":{"$error":"#DIV/0!"}},{"$f":"[2]Blad2!L6","v":{"$error":"#DIV/0!"}}]
[]
["GWVOORRONDE",{"$f":"[2]Blad2!B8","v":0},24,{"$f":"[2]Blad2!E8","v":5},{"$f":"[2]Blad2!F8","v":6},{"$f":"[2]Blad2!H8","v":{"$error":"#DIV/0!"}},{"$f":"[2]Blad2!I8","v":1},2,{"$f":"[2]Blad2!K8","v":{"$error":"#DIV/0!"}},{"$f":"[2]Blad2!L8","v":{"$error":"#DIV/0!"}}]
["GWVOORRONDE",{"$f":"[2]Blad2!B9","v":0},24,{"$f":"[2]Blad2!E9","v":5},{"$f":"[2]Blad2!F9","v":6},{"$f":"[2]Blad2!H9","v":{"$error":"#DIV/0!"}},{"$f":"[2]Blad2!I9","v":1},2,{"$f":"[2]Blad2!K9","v":{"$error":"#DIV/0!"}},{"$f":"[2]Blad2!L9","v":{"$error":"#DIV/0!"}}]
["GWVOORRONDE",{"$f":"[2]Blad2!B10","v":0},24,{"$f":"[2]Blad2!E10","v":5},{"$f":"[2]Blad2!F10","v":6},{"$f":"[2]Blad2!H10","v":{"$error":"#DIV/0!"}},{"$f":"[2]Blad2!I10","v":1},2,{"$f":"[2]Blad2!K10","v":{"$error":"#DIV/0!"}},{"$f":"[2]Blad2!L10","v":{"$error":"#DIV/0!"}}]
["GWVOORRONDE",{"$f":"[2]Blad2!B11","v":0},24,{"$f":"[2]Blad2!E11","v":5},{"$f":"[2]Blad2!F11","v":6},{"$f":"[2]Blad2!H11","v":{"$error":"#DIV/0!"}},{"$f":"[2]Blad2!I11","v":1},2,{"$f":"[2]Blad2!K11","v":{"$error":"#DIV/0!"}},{"$f":"[2]Blad2!L11","v":{"$error":"#DIV/0!"}}]
["GWVOORRONDE",{"$f":"[2]Blad2!B12","v":0},24,{"$f":"[2]Blad2!E12","v":5},{"$f":"[2]Blad2!F12","v":6},{"$f":"[2]Blad2!H12","v":{"$error":"#DIV/0!"}},{"$f":"[2]Blad2!I12","v":1},2,{"$f":"[2]Blad2!K12","v":{"$error":"#DIV/0!"}},{"$f":"[2]Blad2!L12","v":{"$error":"#DIV/0!"}}]
["GWVOORRONDE",{"$f":"[2]Blad2!B13","v":0},24,{"$f":"[2]Blad2!E13","v":5},{"$f":"[2]Blad2!F13","v":6},{"$f":"[2]Blad2!H13","v":{"$error":"#DIV/0!"}},{"$f":"[2]Blad2!I13","v":1},2,{"$f":"[2]Blad2!K13","v":{"$error":"#DIV/0!"}},{"$f":"[2]Blad2!L13","v":{"$error":"#DIV/0!"}}]
[]
["GWVOORRONDE",{"$f":"[2]Blad2!B15","v":0},24,{"$f":"[2]Blad2!E15","v":5},7,{"$f":"[2]Blad2!H15","v":{"$error":"#DIV/0!"}},{"$f":"[2]Blad2!I15","v":1},2,{"$f":"[2]Blad2!K15","v":{"$error":"#DIV/0!"}},{"$f":"[2]Blad2!L15","v":{"$error":"#DIV/0!"}}]
["GWVOORRONDE",{"$f":"[2]Blad2!B16","v":0},24,{"$f":"[2]Blad2!E16","v":5},7,{"$f":"[2]Blad2!H16","v":{"$error":"#DIV/0!"}},{"$f":"[2]Blad2!I16","v":1},2,{"$f":"[2]Blad2!K16","v":{"$error":"#DIV/0!"}},{"$f":"[2]Blad2!L16","v":{"$error":"#DIV/0!"}}]
["GWVOORRONDE",{"$f":"[2]Blad2!B17","v":0},24,{"$f":"[2]Blad2!E17","v":5},7,{"$f":"[2]Blad2!H17","v":{"$error":"#DIV/0!"}},{"$f":"[2]Blad2!I17","v":1},2,{"$f":"[2]Blad2!K17","v":{"$error":"#DIV/0!"}},{"$f":"[2]Blad2!L17","v":{"$error":"#DIV/0!"}}]
["GWVOORRONDE",{"$f":"[2]Blad2!B18","v":0},24,{"$f":"[2]Blad2!E18","v":5},7,{"$f":"[2]Blad2!H18","v":{"$error":"#DIV/0!"}},{"$f":"[2]Blad2!I18","v":1},2,{"$f":"[2]Blad2!K18","v":{"$error":"#DIV/0!"}},{"$f":"[2]Blad2!L18","v":{"$error":"#DIV/0!"}}]
["GWVOORRONDE",{"$f":"[2]Blad2!B19","v":0},24,{"$f":"[2]Blad2!E19","v":5},7,{"$f":"[2]Blad2!H19","v":{"$error":"#DIV/0!"}},{"$f":"[2]Blad2!I19","v":1},2,{"$f":"[2]Blad2!K19","v":{"$error":"#DIV/0!"}},{"$f":"[2]Blad2!L19","v":{"$error":"#DIV/0!"}}]
["GWVOORRONDE",{"$f":"[2]Blad2!B20","v":0},24,{"$f":"[2]Blad2!E20","v":5},7,{"$f":"[2]Blad2!H20","v":{"$error":"#DIV/0!"}},{"$f":"[2]Blad2!I20","v":1},2,{"$f":"[2]Blad2!K20","v":{"$error":"#DIV/0!"}},{"$f":"[2]Blad2!L20","v":{"$error":"#DIV/0!"}}]

{"sheet":"dataweb","index":5,"n_rows":28,"n_cols":36,"rows_kept":28,"cut":false,"hidden":false,"merged":[]}
["Lic","CLUB-ID","CLUBNAAM","NAAM SPELER",null,null,null,null,null,null,null,null,null,null,null,null,null,null,null,null,null,null,null,null,null,"VKP15","VK15G","VK15OPM","VK15NP"]
[{"$f":"[2]Blad2!B1","v":0},null,null,{"$f":"[2]SAMENVATTING!B9","v":{"$error":"#N/A"}},null,null,null,null,null,null,null,null,null,null,null,null,null,null,null,null,null,null,null,null,null,{"$f":"IF(LEN(AE2)>0,HLOOKUP(AE2,$E$23:$AG$24,2,0))","v":60},{"$f":"[2]SAMENVATTING!J9","v":{"$error":"#DIV/0!"}},{"$f":"IF(LEN(AG2)>0,HLOOKUP(AG2,$E$27:$AD$28,2,0))","v":{"$error":"#DIV/0!"}},{"$f":"IF(LEN(AF2)>0,HLOOKUP(AF2,$E$23:$AG$24,2,0))","v":{"$error":"#DIV/0!"}},null,{"$f":"databank!E2","v":5},{"$f":"databank!J2","v":{"$error":"#DIV/0!"}},{"$f":"databank!F2","v":{"$error":"#DIV/0!"}}]
[{"$f":"[2]Blad2!B2","v":0},null,null,{"$f":"[2]SAMENVATTING!B10","v":{"$error":"#N/A"}},null,null,null,null,null,null,null,null,null,null,null,null,null,null,null,null,null,null,null,null,null,60,{"$f":"[2]SAMENVATTING!J10","v":{"$error":"#DIV/0!"}},{"$error":"#DIV/0!"},{"$error":"#DIV/0!"},null,{"$f":"databank!E3","v":5},{"$f":"databank!J3","v":{"$error":"#DIV/0!"}},{"$f":"databank!F3","v":{"$error":"#DIV/0!"}}]
[{"$f":"[2]Blad2!B3","v":0},null,null,{"$f":"[2]SAMENVATTING!B11","v":{"$error":"#N/A"}},null,null,null,null,null,null,null,null,null,null,null,null,null,null,null,null,null,null,null,null,null,60,{"$f":"[2]SAMENVATTING!J11","v":{"$error":"#DIV/0!"}},{"$error":"#DIV/0!"},{"$error":"#DIV/0!"},null,{"$f":"databank!E4","v":5},{"$f":"databank!J4","v":{"$error":"#DIV/0!"}},{"$f":"databank!F4","v":{"$error":"#DIV/0!"}}]
[{"$f":"[2]Blad2!B4","v":0},null,null,{"$f":"[2]SAMENVATTING!B12","v":{"$error":"#N/A"}},null,null,null,null,null,null,null,null,null,null,null,null,null,null,null,null,null,null,null,null,null,60,{"$f":"[2]SAMENVATTING!J12","v":{"$error":"#DIV/0!"}},{"$error":"#DIV/0!"},{"$error":"#DIV/0!"},null,{"$f":"databank!E5","v":5},{"$f":"databank!J5","v":{"$error":"#DIV/0!"}},{"$f":"databank!F5","v":{"$error":"#DIV/0!"}}]
[{"$f":"[2]Blad2!B5","v":0},null,null,{"$f":"[2]SAMENVATTING!B13","v":{"$error":"#N/A"}},null,null,null,null,null,null,null,null,null,null,null,null,null,null,null,null,null,null,null,null,null,60,{"$f":"[2]SAMENVATTING!J13","v":{"$error":"#DIV/0!"}},{"$error":"#DIV/0!"},{"$error":"#DIV/0!"},null,{"$f":"databank!E6","v":5},{"$f":"databank!J6","v":{"$error":"#DIV/0!"}},{"$f":"databank!F6","v":{"$error":"#DIV/0!"}}]
[{"$f":"[2]Blad2!B6","v":0},null,null,{"$f":"[2]SAMENVATTING!B14","v":{"$error":"#N/A"}},null,null,null,null,null,null,null,null,null,null,null,null,null,null,null,null,null,null,null,null,null,60,{"$f":"[2]SAMENVATTING!J14","v":{"$error":"#DIV/0!"}},{"$error":"#DIV/0!"},{"$error":"#DIV/0!"},null,{"$f":"databank!E7","v":5},{"$f":"databank!J7","v":{"$error":"#DIV/0!"}},{"$f":"databank!F7","v":{"$error":"#DIV/0!"}}]
[]
[{"$f":"[2]Blad2!B8","v":0},null,null,{"$f":"[2]SAMENVATTING!B16","v":{"$error":"#N/A"}},null,null,null,null,null,null,null,null,null,null,null,null,null,null,null,null,null,null,null,null,null,{"$f":"IF(LEN(AE9)>0,HLOOKUP(AE9,$E$23:$AG$24,2,0))","v":90},{"$f":"[2]SAMENVATTING!J16","v":{"$error":"#DIV/0!"}},{"$f":"IF(LEN(AG9)>0,HLOOKUP(AG9,$E$27:$AD$28,2,0))","v":{"$error":"#DIV/0!"}},{"$f":"IF(LEN(AF9)>0,HLOOKUP(AF9,$E$23:$AG$24,2,0))","v":{"$error":"#DIV/0!"}},null,{"$f":"databank!E9","v":6},{"$f":"databank!J9","v":{"$error":"#DIV/0!"}},{"$f":"databank!F9","v":{"$error":"#DIV/0!"}}]
[{"$f":"[2]Blad2!B9","v":0},null,null,{"$f":"[2]SAMENVATTING!B17","v":{"$error":"#N/A"}},null,null,null,null,null,null,null,null,null,null,null,null,null,null,null,null,null,null,null,null,null,90,{"$f":"[2]SAMENVATTING!J17","v":{"$error":"#DIV/0!"}},{"$error":"#DIV/0!"},{"$error":"#DIV/0!"},null,{"$f":"databank!E10","v":6},{"$f":"databank!J10","v":{"$error":"#DIV/0!"}},{"$f":"databank!F10","v":{"$error":"#DIV/0!"}}]
[{"$f":"[2]Blad2!B10","v":0},null,null,{"$f":"[2]SAMENVATTING!B18","v":{"$error":"#N/A"}},null,null,null,null,null,null,null,null,null,null,null,null,null,null,null,null,null,null,null,null,null,90,{"$f":"[2]SAMENVATTING!J18","v":{"$error":"#DIV/0!"}},{"$error":"#DIV/0!"},{"$error":"#DIV/0!"},null,{"$f":"databank!E11","v":6},{"$f":"databank!J11","v":{"$error":"#DIV/0!"}},{"$f":"databank!F11","v":{"$error":"#DIV/0!"}}]
[{"$f":"[2]Blad2!B11","v":0},null,null,{"$f":"[2]SAMENVATTING!B19","v":{"$error":"#N/A"}},null,null,null,null,null,null,null,null,null,null,null,null,null,null,null,null,null,null,null,null,null,90,{"$f":"[2]SAMENVATTING!J19","v":{"$error":"#DIV/0!"}},{"$error":"#DIV/0!"},{"$error":"#DIV/0!"},null,{"$f":"databank!E12","v":6},{"$f":"databank!J12","v":{"$error":"#DIV/0!"}},{"$f":"databank!F12","v":{"$error":"#DIV/0!"}}]
[{"$f":"[2]Blad2!B12","v":0},null,null,{"$f":"[2]SAMENVATTING!B20","v":{"$error":"#N/A"}},null,null,null,null,null,null,null,null,null,null,null,null,null,null,null,null,null,null,null,null,null,90,{"$f":"[2]SAMENVATTING!J20","v":{"$error":"#DIV/0!"}},{"$error":"#DIV/0!"},{"$error":"#DIV/0!"},null,{"$f":"databank!E13","v":6},{"$f":"databank!J13","v":{"$error":"#DIV/0!"}},{"$f":"databank!F13","v":{"$error":"#DIV/0!"}}]
[{"$f":"[2]Blad2!B13","v":0},null,null,{"$f":"[2]SAMENVATTING!B21","v":{"$error":"#N/A"}},null,null,null,null,null,null,null,null,null,null,null,null,null,null,null,null,null,null,null,null,null,90,{"$f":"[2]SAMENVATTING!J21","v":{"$error":"#DIV/0!"}},{"$error":"#DIV/0!"},{"$error":"#DIV/0!"},null,{"$f":"databank!E14","v":6},{"$f":"databank!J14","v":{"$error":"#DIV/0!"}},{"$f":"databank!F14","v":{"$error":"#DIV/0!"}}]
[]
[{"$f":"[2]Blad2!B15","v":0},null,null,{"$f":"[2]SAMENVATTING!B24","v":{"$error":"#N/A"}},null,null,null,null,null,null,null,null,null,null,null,null,null,null,null,null,null,null,null,null,null,{"$f":"IF(LEN(AE16)>0,HLOOKUP(AE16,$E$23:$AG$24,2,0))","v":120},{"$f":"[2]SAMENVATTING!J24","v":{"$error":"#DIV/0!"}},{"$f":"IF(LEN(AG16)>0,HLOOKUP(AG16,$E$27:$AD$28,2,0))","v":{"$error":"#DIV/0!"}},{"$f":"IF(LEN(AF16)>0,HLOOKUP(AF16,$E$23:$AG$24,2,0))","v":{"$error":"#DIV/0!"}},null,{"$f":"databank!E16","v":7},{"$f":"databank!J16","v":{"$error":"#DIV/0!"}},{"$f":"databank!F16","v":{"$error":"#DIV/0!"}}]
[{"$f":"[2]Blad2!B16","v":0},null,null,{"$f":"[2]SAMENVATTING!B25","v":{"$error":"#N/A"}},null,null,null,null,null,null,null,null,null,null,null,null,null,null,null,null,null,null,null,null,null,120,{"$f":"[2]SAMENVATTING!J25","v":{"$error":"#DIV/0!"}},{"$error":"#DIV/0!"},{"$error":"#DIV/0!"},null,{"$f":"databank!E17","v":7},{"$f":"databank!J17","v":{"$error":"#DIV/0!"}},{"$f":"databank!F17","v":{"$error":"#DIV/0!"}}]
[{"$f":"[2]Blad2!B17","v":0},null,null,{"$f":"[2]SAMENVATTING!B26","v":{"$error":"#N/A"}},null,null,null,null,null,null,null,null,null,null,null,null,null,null,null,null,null,null,null,null,null,120,{"$f":"[2]SAMENVATTING!J26","v":{"$error":"#DIV/0!"}},{"$error":"#DIV/0!"},{"$error":"#DIV/0!"},null,{"$f":"databank!E18","v":7},{"$f":"databank!J18","v":{"$error":"#DIV/0!"}},{"$f":"databank!F18","v":{"$error":"#DIV/0!"}}]
[{"$f":"[2]Blad2!B18","v":0},null,null,{"$f":"[2]SAMENVATTING!B27","v":{"$error":"#N/A"}},null,null,null,null,null,null,null,null,null,null,null,null,null,null,null,null,null,null,null,null,null,120,{"$f":"[2]SAMENVATTING!J27","v":{"$error":"#DIV/0!"}},{"$error":"#DIV/0!"},{"$error":"#DIV/0!"},null,{"$f":"databank!E19","v":7},{"$f":"databank!J19","v":{"$error":"#DIV/0!"}},{"$f":"databank!F19","v":{"$error":"#DIV/0!"}}]
[{"$f":"[2]Blad2!B19","v":0},null,null,{"$f":"[2]SAMENVATTING!B28","v":{"$error":"#N/A"}},null,null,null,null,null,null,null,null,null,null,null,null,null,null,null,null,null,null,null,null,null,120,{"$f":"[2]SAMENVATTING!J28","v":{"$error":"#DIV/0!"}},{"$error":"#DIV/0!"},{"$error":"#DIV/0!"},null,{"$f":"databank!E20","v":7},{"$f":"databank!J20","v":{"$error":"#DIV/0!"}},{"$f":"databank!F20","v":{"$error":"#DIV/0!"}}]
[{"$f":"[2]Blad2!B20","v":0},null,null,{"$f":"[2]SAMENVATTING!B29","v":{"$error":"#N/A"}},null,null,null,null,null,null,null,null,null,null,null,null,null,null,null,null,null,null,null,null,null,120,{"$f":"[2]SAMENVATTING!J29","v":{"$error":"#DIV/0!"}},{"$error":"#DIV/0!"},{"$error":"#DIV/0!"},null,{"$f":"databank!E21","v":7},{"$f":"databank!J21","v":{"$error":"#DIV/0!"}},{"$f":"databank!F21","v":{"$error":"#DIV/0!"}}]
[]
[null,null,null,"cat",9,null,null,null,null,null,null,null,null,null,null,null,null,null,null,null,null,null,null,null,null,8,7,6,5]
[null,null,null,"punten",300,null,null,null,null,null,null,null,null,null,null,null,null,null,null,null,null,null,null,null,null,200,120,90,60,null,null,null,null,null,null,"  "]
[]
[]
[null,null,null,"code",1,null,null,null,null,null,null,null,null,null,null,null,null,null,null,null,null,null,null,null,null,2,3,5,27,28]
[null,null,null,"opm","PR",null,null,null,null,null,null,null,null,null,null,null,null,null,null,null,null,null,null,null,null,"PR 3/4","OG","MG","DPR","DRPR"]

{"sheet":"LEDEN","index":6,"n_rows":858,"n_cols":4,"rows_kept":858,"cut":false,"hidden":false,"merged":[]}
[null,null,null,"NS"]
[8758,"DUYM Ignace","ACG"]
[4505,"BRACKE Peter","ACG"]
[2314,"SONCK ROBBY","ACG"]
[6927,"DUJARDIN Luc","ACG"]
[4432,"BAETE Jean-Pierre","ACG"]
[6705,"BERNAERDT Roland","ACG"]
[4496,"VAN HANEGEM Izaak","ACG"]
[7125,"Nuytten Renold","ACG"]
[7302,"DE CRAECKER Werner","ACG"]
[9800,"DE CRAECKER Emma (jeugd)","ACG"]
[9826,"DE BIE Rudy","ACG"]
[9261,"de MEULEMEESTER Cédric","ACG"]
[1036,"DEPOORTER MIEKE","ACG"]
[5587,"GERMONPRE Luc","ACG"]
[8671,"DE MUYNCK Jean-Pierre","ACG"]
[8672,"DEMOOR Danny","ACG"]
[6428,"MEULEMAN Rudy","ACG"]
[9975,"WILLEMS Peter ","ACG"]
[7303,"FRANCK Franky","ACG"]
[8888,"DE MEYER Erik","ACG"]
[]
[4854,"ROSIER Peter","BCSK"]
[4895,"DE BLOCK Omer","BCSK"]
[6488,"DE WITTE Franky","BCSK"]
[6489,"DE WITTE Jeffrey","BCSK"]
[7812,"BOERJAN Pierre","BCSK"]
[8674,"VAN LEUVENHAGE Dylan","BCSK"]
[8900,"JANSSENS Dirk","BCSK"]
[1294,"BACKMAN Werner","BCSK"]
[8133,"VAN CRAENENBROECK Theo","BCSK"]
["6784B","VAN BIESEN Tom","BCSK"]
[9441,"ROSIER Nick","BCSK"]
[9442,"VERGULT François","BCSK"]
[4894,"DAELMAN Walther","BCSK"]
[8507,"TROONBEECKX Willy","BCSK"]
[8073,"DE WITTE Tamara","BCSK"]
[8385,"GODDAERT Johan","BCSK"]
[9955,"DE RUDDER David","BCSK"]
[9348,"WOUTERS Marc","BCSK"]
[8650,"DE BOEY Gijs","BCSK"]
[7918,"ROSIER Noah","BCSK"]
[7562,"THUY Marc","BCSK"]
[7915,"DE LEEUW Willy","BCSK","NS"]
[7918,"ROSIER Noah","BCSK","NS"]
[]
[8689,"DEWAELE Eddy","CBC-DLS"]
[8690,"JOYE Rik","CBC-DLS"]
[8704,"CALLENS Filip","CBC-DLS"]
[8691,"BRUNEEL Norbert ","CBC-DLS"]
[8649,"VAN DE VELDE Desire","CBC-DLS"]
[8658,"MONDELAERS Dries","CBC-DLS"]
[8652,"TANGHE Freddy","CBC-DLS"]
[8036,"VERCAIGNE Mario","CBC-DLS"]
[8044,"VANDENBULCKE Paul","CBC-DLS"]
[8044,"VANDENBULCKE Paul","CBC-DLS","NS"]
[8036,"VERCAIGNE Mario","CBC-DLS","NS"]
[8048,"DELESIE Kris","CBC-DLS","NS"]
[]
[4192,"BEAUJEAN Karel","CM"]
[9059,"BERTEN Franky","CM"]
[5500,"ROELANTS Karel","CM"]
[4143,"VAN CRAEN Albert","CM"]
[6189,"VANDENABEELE Marc","CM"]
[7796,"DE LAET Cassy","CM"]
[7822,"SCHOUTETENS Marc","CM"]
[9512,"DE SCHILDER Leon","CM"]
[9513,"CARPAY Henri","CM"]
[4682,"SCHOUTETENS Pieter","CM"]
[9413,"DANNEELS Laurent","DK"]
[5682,"DELANGHE Lievin","DK"]
[4188,"RONDELEZ Noel","DK"]
[4180,"CONSTANT Geert","DK"]
[]
[4763,"CASTELEYN Rik","K.DOS"]
[1061,"GELDHOF Frank","K.DOS"]
[4762,"CASTELEYN Henk","K.DOS"]
[4765,"DEBAES Peter","K.DOS"]
[4768,"DEDIER Georges","K.DOS"]
[8156,"DETOLLENAERE Jonny","K.DOS"]
[4776,"HOUTHAEVE Jean-Marie","K.DOS"]
[4778,"LEYN Philippe","K.DOS"]
[7697,"GHESQUIERE Jozef","K.DOS"]
[8090,"VANLAUWE Stephan","K.DOS"]
[4693,"MOSTREY Peter","K.DOS"]
[4733,"NUYTTENS Gino","K.DOS"]
[6720,"WILLE Etienne","K.DOS"]
[6094,"VANACKER Steven","K.DOS"]
[9461,"RONDELEZ Kenneth","K.DOS"]
[2299,"VANTHOURNOUT Michel","K.DOS"]
[1055,"BRUWIER Erwin","K.DOS"]
[8705,"STEVENS Ilse","K.DOS"]
[4774,"DUYCK Peter","K.DOS"]
[8697,"MELNYTSCHENKO Cédric","K.DOS"]
[4759,"WARLOP Luc","K.DOS"]
[1060,"Wittevrongel Dirk","K.DOS"]
[9018,"GHEVART Jean","K.DOS"]
[9957,"BRUWIER Ludwin","K.DOS"]
[9958,"DEBLAUWE Dimitri","K.DOS"]
[9766,"VANNESTE Philip","K.DOS"]
[9045,"WALLART Jean-Charles","K.DOS"]
[7529,"VASSEUR Patrick","K.DOS"]
[8002,"MAES Pascal","K.DOS","NS"]
[]
[4454,"DEPOORTER Reginald","GS"]
[4466,"TREMERIE Walter","GS"]
[4541,"DELLAERT Marc","GS"]
[4587,"VERSTRAETEN Frank","GS"]
[6701,"BROCHE Philippe","GS"]
[6703,"CLAUS Pascal","GS"]
[7203,"DELARUE Dirk","GS"]
[7498,"VAN DAM Jens","GS"]
[8163,"DE WEIRDT Jean-Marie","GS"]
[8654,"BAETSLE Peter","GS"]
[8890,"VAN HOLLE Jean-Pierre","GS"]
[4506,"BRACKE Tom","GS"]
[9419,"MOEYKENS Biacio","GS"]
[9959,"DE DEYNE Firmin","GS"]
[8655,"TOLLEBEKE Arthur","GS"," "]
[4394,"CREVE Camiel","GS"]
[]
[8387,"HEBBELINCK Luc","K&V","NS"]
[8918,"VANDENBERGHE Pascal ","K&V"]
[9428,"WIELFAERT Curt","K&V"]
[9429,"HERREMAN Luc","K&V"]
[9520,"VANDERLINDEN Aimé","K&V"]
[9960,"DE VOS Antoon","K&V"]
[9262,"CLAEYS Hubert","K&V"]
[9782,"D'HAEZE Adolf","K&V"]
[9781,"DOS SANTOS Jose","K&V"]
[9608,"VAN BREDA Mike ","K&V"]
[9522,"LEEMAN Rudy","K&V"]
[9238,"SIMONS Rudi","K&V"]
[9264,"REYCHLER Hedwig","K&V"]
[9262,"CLAEYS Hubert","K&V"]
[8035,"VAN THUYNE Rudy","K&V"]
[]
[2944,"t SEYEN Roland","K.BR"]
[4148,"DE CUYPER René","K.BR"]
[4150,"DEVROE Eddy","K.BR"]
[4156,"SEYS Norbert","K.BR"]
[4214,"DE BAERE Karel","K.BR"]
[4217,"DE GRAEVE David","K.BR"]
[4222,"DE QUEKER Guido","K.BR"]
[4223,"DRUWEL Francois","K.BR"]
[4224,"GUIDE Jean-Pierre","K.BR"]
[4241,"VANHECKE Rik","K.BR"]
[4242,"VERCRUYSSE Johan","K.BR"]
[4557,"SERWEYTENS Lieven","K.BR"]
[4779,"LEYS Bart","K.BR"]
[5186,"DEFRUYT Dirk","K.BR"]
[5190,"SAVER André","K.BR"]
[5408,"VANRAPENBUSCH Franky","K.BR"]
[5685,"BOECKAERT Eric","K.BR"]
[5689,"SAVER Koen","K.BR"]
[6081,"QUITTELIER Stephane","K.BR"]
[7795,"HACKE Jean-Marie","K.BR"]
[7797,"BEIRENS Marc","K.BR"]
[8162,"FLAMEE Kurt","K.BR"]
[8454,"STUYVAERT Marijn","K.BR"]
[8669,"DE CLERCK Jean","K.BR"]
[8670,"SCHOE Henk","K.BR"]
[4185,"DEPOORTER Daniël","K.BR"]
[9062,"DE BUSSCHER Walter","K.BR"]
[8921,"CHRISTIAENS Danny","K.BR"]
[7801,"EISCHEN Frédéric","K.BR"]
[4250,"COBBAERT  Thierry","K.BR"]
[9257,"MUS Hendrik","K.BR"]
[9258,"STEFFENS Alain","K.BR"]
[4267,"THOMAS Peter","K.BR"]
[4722,"BLAUWBLOMME Henk","K.BR"]
[9256,"DALLINGA Louis","K.BR"]
[8362,"DEKRAKER Jean-Paul","K.BR"]
[5691,"TORRES Manuel","K.BR"]
[4682,"SCHOUTETENS Pieter","K.BR"]
[7462,"CREYF Fernand","K.BR"]
[4071,"DE BAERE Eddy","K.BR"]
[4644,"DUMON Dirk","K.BR"]
[6680,"FLAMEE Kurt","K.BR"]
[8881,"HERPOEL Rony","K.BR"]
[4187,"ROGIERS Marc","K.BR"]
[4184,"DEPOORTER Chris","K.BR"]
[5439,"DUCHEYNE Kenny","K.BR"]
[9279,"DALINGA Meerten","K.BR"]
[4233,"PIETERS Ronny","K.BR"]
[9778,"POPPE Rudy","K.BR"]
[4363,"PRIEUS Andy","K.BR"]
[4070,"DE BAERE Cindy","K.BR"]
[8677,"CAMPE Etienne","K.BR"]
[5678,"VERSCHAEVE Edwin","K.BR"]
[8676,"NEUBOURG Freddy","K.BR"]
[7036,"MISMAN Eddy","K.Br"]
[7311,"BUZEYN Jean","K.Br","NS"]
[9595,"VERBEURE Danny","K.Br"]
[6435,"BELAEY DANNY","K.Br"]
[7874,"MEERSMAN Chrisrtian","K.Br","NS"]
[7866,"VAN LAARHOVEN Roland","K.Br","NS"]
[7865,"VINK Michael","K.Br","NS"]
[7052,"TEMMERMAN Jurgen","K.Br","NS"]
[]
[4422,"DE MEYER Rudi","K.EBC"]
[1022,"MENHEER Leslie","K.EBC"]
[4473,"DE BAETS Ronny","K.EBC"]
[4482,"STAELENS Freddy","K.EBC"]
[4538,"DE LOMBAERT Albert","K.EBC"]
[4539,"DE MIL Christiaan","K.EBC"]
[4544,"GEVAERT Michel","K.EBC"]
[4545,"GOETHALS Armand","K.EBC"]
[4558,"SIMOENS Wilfried","K.EBC"]
[4559,"STANDAERT Arthur","K.EBC"]
[4560,"STANDAERT Peter","K.EBC"]
[4561,"VAN DAMME Etienne","K.EBC"]
[4567,"VLERICK Raf","K.EBC"]
[5212,"STEVENS Martin","K.EBC"]
[5769,"HAERENS Raf","K.EBC"]
[9067,"De Letter Sandra","K.EBC"]
[6096,"VAN REETH Rudy","K.EBC"]
[6097,"VAN DE VOORDE Johan","K.EBC"]
[6709,"WELVAERT Yves","K.EBC"]
[7478,"BAUMGARTE Cees","K.EBC"]
[8659,"LAMPAERT Eddy","K.EBC"]
[9057,"BONTE William","K.EBC"]
[7474,"Geirnaert Marc","K.EBC"]
[7312,"Van Acker Johan","K.EBC"]
[6094,"Van Acker Steven","K.EBC"]
[5015,"Himschoot Daniel","K.EBC"]
[1046,"Bruggeman Franky ","K.EBC"]
[6690,"BAUWENS Etienne","K.EBC"]
[4395,"DE PAEPE Roland","K.EBC"]
[8656,"MELKEBEKE Julien","K.EBC"]
[4446,"Fourneau Alain","K.EBC"]
[4490,"VAN LANCKER Pierre","K.EBC"]
[9524,"CLAERHOUT Robin","K.EBC"]
[7479,"HONGENAERT Erwin","K.EBC"]
[9525,"DE JONGE Cor","K.EBC"]
[9267,"JANSSEN Willem","K.EBC"]
[1071,"BILLIET Jelle","K.EBC"]
["6417B","BLOMME Jean-Thierry","K.EBC"]
[9807,"DE BRUYCKER Pierre","K.EBC"]
[4491,"VAN SCHUYLENBERGH Jean-Paul","K.EBC"]
[7906,"DE CLERCQ Carlos","K.EBC","NS"]
[]
[9424,"VAN DEN  EEDE  Marc","K.EWH"]
[4425,"GEVAERT André","K.EWH"]
[8063,"COPPENS Christiaan","K.EWH"]
[8657,"HOLDERBEKE Alex","K.EWH"]
[4425,"GEVAERT André ","K.EWH"]
[7806,"BAUTE Steven","K.EWH"]
[9593,"TRENSON Gabriël","K.EWH"]
[4446,"FOURNEAU Alain","K.EWH"]
[9592,"DE LOBEL Marc","K.EWH"]
[4472,"DE BAETS Danny","K.EWH","HNS"]
[7879,"SILVERSMET Patrick","K.EWH","NS"]
[9966,"BRUGGEMAN Etienne"," K.EWH","NS"]
[]
[7465,"COUSSEMENT Wim","K.GHOK"]
[8047,"DEVRIENDT Bart","K.GHOK"]
[4435,"HERREMAN Roger","K.GHOK"]
[4551,"LEMAN Gwen","K.GHOK"]
[4775,"GOETHALS Didier","K.GHOK"]
[4789,"CAPPELLE Herwig","K.GHOK"]
[4790,"DE MOOR Frederik","K.GHOK"]
[4791,"DE MOOR Willy","K.GHOK"]
[4793,"DETAVERNIER Hendrik","K.GHOK"]
[7823,"JOYE Robert","K.GHOK"]
[8513,"DECOCK Johan","K.GHOK"]
[4659,"BAS Jacques","K.GHOK"]
[4656,"POLLIE Luc","K.GHOK"]
[3807,"VERBRUGGHE Johan","K.GHOK"]
[9274,"VERBRUGGHE Philip","K.GHOK"]
[7689,"BOSSAERT Dirk","K.GHOK"]
[8736,"VEYS Renzo","K.GHOK"]
[9440,"DECOCK Stephan","K.GHOK"]
[8688,"DECEUNINCK Kurt","K.GHOK"]
[9437,"DHAEYER Rémy","K.GHOK"]
[8088,"VERCAEMERE Jaak","K.GHOK"]
[1143,"LOUAGIE Bjorn","K.GHOK"]
[7821,"VROMANT Marc","K.GHOK"]
[5746,"NICHELSON Pascal","K.GHOK"]
[7814,"DEWILDE Johan","K.GHOK"]
[8873,"DEVOS Claude","K.GHOK"]
[9531,"ROELAND Juliaan","K.GHOK"]
[8282,"PATTYN Guy","K.GHOK"]
[9532,"VIENNE Isabelle","K.GHOK"]
[7499,"GRAYE André","K.GHOK"]
[7524,"SCHOKELE Ronny","K.GHOK"]
[4687,"VANHAESEBROEK Didier","K.GHOK"]
[9433,"LATRUWE Nicolas","K.GHOK"]
[9511,"HOUSSIN Mario","K.GHOK"]
[4435,"HERREMAN Roger","K.GHOK"]
[9783,"DEVOLDER Freddy","K.GHOK"]
[9764,"VERCAEMERE Philippe","K.GHOK"]
[9855,"CARDOEN Kurt","K.GHOK"]
[9765,"VERCAEMERE Bjorn","K.GHOK"]
[9785,"DE SMET Wim","K.GHOK"]
[9079,"HIMPE Jean","K.GHOK"]
[9502,"Himpe Jeremy  ","K.GHOK"]
[7458,"DUMON Eddy","K.GHOK"]
[9439,"VANDENBERGHE Rudy","K.GHOK"]
[9080,"VANKEIRSBULCK Alex","K.GHOK"]
[8735,"VAN DEN BUVERIE Eric","K.GHOK"]
[4147,"D'HONT Steven","K.GHOK"]
[7465,"COUSSEMENT Wim","K.GHOK"]
[8873,"DEVOS Claude","K.GHOK"]
[7316,"RONDELE Freddy","K.GHOK"]
[8031,"DUJARDIN Jean-Pierre","K.GHOK","NS"]
[8029,"STAMPER Stefaan","K.GHOK","NS"]
[8024,"VERBRUGGE Pol","K.GHOK","NS"]
[8022,"VION Mark","K.GHOK","NS"]
[]
[6678,"DE CORTE Jan","K.Kn"]
[6399,"DELAERE Marc","K.Kn"]
[7678,"DE VREEZE Patrick","K.KN"]
[5178,"FRANKEN Luc","K.KN"]
[7284,"LANDUYT Sacha","K.KN"]
[4522,"METTEPENNINGEN Julien","K.KN"]
[4114,"VAN KREIJ Jo","K.KN"]
[6806,"VANHAEREN Leon","K.KN"]
[8678,"GHAZAL Ahmad ","K.KN"]
[7863,"DEVREEZE Christiaan","K.Kn","NS"]
[]
[9421,"Caudron Danny","K. ME"]
[8410,"LIPPENS Tony","K.ME"]
[9420,"CAUDRON Bjorn","K.ME"]
[4415,"VANPETEGHEM Alex","K.ME"]
[4443,"VERBEKEN Albert","K.ME"]
[4529,"VERSNOYEN François","K.ME"]
[4643,"MESURE Freddy","K.ME"]
[6715,"BRUGGEMAN Roger","K.ME"]
[8664,"OOSTERLINCK Luc","K.ME"]
[8665,"VAN DELSEN Edgard","K.ME"]
[8666,"BRACKE André","K.ME"]
[8898,"RAES Freddy","K.ME"]
[9263,"DE  VOS  GUIDO","K.ME"]
[9527,"BORGILIOEN  MARCEL","K.ME"]
[8663,"JANSSENS Roger","K.ME"]
[]
[8717,"VAN DEN EEDEN Kurt","K.SNBA"]
[4907,"CORNELISSEN Pierre","K.SNBA"]
[4913,"DE RUYTE Yvan","K.SNBA"]
[4916,"DE WITTE William","K.SNBA"]
[4922,"LAUREYS Wilfried","K.SNBA"]
[6743,"DE RUYTE Tom","K.SNBA"]
[7923,"VAN DEN BERGHE Roland","K.SNBA"]
[8414,"MAES Lucien","K.SNBA"]
[8681,"VAN LEEUWEN A.E.M","K.SNBA"]
[8903,"NEYTS Pierre","K.SNBA"]
[9083,"VAN DEN BERGHE André","K.SNBA"]
[4920,"HEERWEGH Robert","K.SNBA"]
[8481,"VAVOURAIKIS  Emmanouil","K.SNBA"]
[9277,"BOLLAERT GUIDO","K.SNBA"]
[7704,"HEERWEGH ERIK","K.SNBA"]
[4859,"CHRISTIAENS Johan","K.SNBA"]
[8149,"D'HONDT Roland","K.SNBA"]
[4950,"DE CONINCK Achille","K.SNBA"]
[1067,"MAES Bart","K.SNBA"]
[8746,"PEERSMAN Luc","K.SNBA"]
[8904,"RAES Wim","K.SNBA"]
[8081,"SLEEBUS Eddy","K.SNBA"]
[9476,"VERHOFSTADT Eddy","K.SNBA"]
[9963,"ROLUS Bob","K.SNBA"]
[5732,"ILIANO Franz","K.SNBA"]
[6564,"MAES Rudy","K.SNBA"]
[7940,"VAN MEIR Frank","K.SNBA"]
[7810,"D'HAENS Peter","K.SNBA"]
[8098,"BORREMANS Raf","K.SNBA"]
[8472,"GOOSSENS Dave","K.SNBA"]
[8468,"VAN STEENACKER Thierry","K.SNBA"]
[7964,"HUYBEN GILBERT","K.SNBA"]
[7972,"MAES ILJA","K.SNBA"]
[7935,"CLARYSSE FRANKIE","K.SNBA"]
[9158,"VAN HOUDENHOVE PATRICK","K.SNBA"]
[4841,"VERPLANCKE Jean-Paul","K.SNBA"]
[7935,"CLARYSSE Frankie","K.SNBA","NS"]
[7964,"HUYBEN Gilbert","K.SNBA","NS"]
[7972,"MAES Ilja","K.SNBA","NS"]
[]
[7875,"VAN LANGENHOVEN Michael","K.STER","NS"]
[7804,"DE BREMAEKER Eric","K.STER"]
[8535,"DE WIN Guy","K.STER"]
[5198,"VAN LAETHEM Rudy","K.STER"]
[9221,"BOSTOEN Kris","K.STER"]
[7054,"LOOS Leo","K.STER"]
[7049,"DE TANT Freddy","K.STER"]
[4345,"PARDAENS Willy","K.STER"]
[4344,"DE WEVER Koen","K.STER"]
[4352,"WAUTERS Johnny","K.STER"]
[9515,"CEULEMANS Benny","K.STER"]
[9517,"GOORDEN Willy","K.STER"]
[4282,"COPPENS Sandro","K.STER"]
[7609,"COLLART Olivier","K.STER"]
[7236,"MARCHARIS Françis","K.STER"]
[9516,"DUJARDIN Geoffrey","K.STER"]
[8017,"VAN RIET Kris ","K.STER"]
[6454,"VERCAMMEN Alwin","K.STER"]
[4320,"VAN LANGENHOVE Alain","K.STER"]
[4324,"DE CONINCK Marc","K.STER"]
[4348,"VAN MUYLEM Norbert","K.STER"]
[9974,"DE FREYN Jasper","K.STER"]
[6088,"SIROYT Davy","K.STER"]
[4341,"DE COSTER Luc","K.STER"]
[]
[4162,"CAPPELLE Eddy","K.ZE"]
[4167,"DECLERCK Gilbert","K.ZE"]
[4171,"FORREST Emiel","K.ZE"]
[4232,"BUYSSE Edgard","K.ZE"]
[9254,"DE PRINCE Luc","K.ZE"]
[9961,"VANDENBROELE Kurt","K.ZE","NS"]
[6078,"VANDEWIELE Eric","K.ZE"]
[]
[6090,"BERGMANS Dion","KAS"]
[4402,"ROELS Roger","KAS"]
[4451,"DE BLEECKER Steven","KAS"]
[4524,"RODTS Piet","KAS"]
[4526,"VAN DE VELDE Marc","KAS"]
[7207,"FEYS Georges","KAS"]
[7209,"VAN WAEYENBERGHE Carlos","KAS"]
[7687,"PIETERS Lionel","KAS"]
[8895,"SANMODESTO José","KAS"]
[4530,"VERSPEELT Filip","KAS"]
[8070,"VAN KERCKHOVE Willem","KAS"]
[8530,"DEMIRCIOGLU Fuat","KAS"]
[8068,"KAHRAMAN Murat","KAS"]
[5705,"LUTTENS Arnold","KAS"]
[9964,"DE MEY Ad","KAS"]
[9965,"SANMODESTO Nicolas","KAS"]
[7112,"DE BRUIN Richard","KAS"]
[4634,"DEVLIEGER David","KAS"]
[4612,"VANDAELE Alex","KAS"]
[7897,"VERMEERSCH Ivan","KAS"]
[7902,"VAN DAELE Ronny","KAS"]
[7902,"VAN DAELE Ronny","KAS","NS"]
[7897,"VERMEERSCH Ivan","KAS","NS"]
[]
[7882,"GANDOLFO Salvatore","K.BCAW","NS"]
[9431,"JACQUEMYN Tony","KBCAW"]
[4845,"STEVENS PATRICK","KBCAW"]
[8349,"CLAERHOUT Bernard","KBCAW"]
[8352,"COSYNS Marc","KBCAW"]
[6706,"DE FAUW Guy","KBCAW"]
[7475,"DE MOL Daniel","KBCAW"]
[6427,"GORLEER Omer","KBCAW"]
[7477,"VAN DE CASTEELE Henri","KBCAW"]
[7698,"VAN FLETEREN Piet","KBCAW"]
[9432,"VANAELST Paul","KBCAW"]
[4613,"VANDAELE Pierre","KBCAW"]
[6713,"VAN ACKER Johan","KBCAW"]
[7476,"DE COOMAN Marcel","KBCAW"]
[8165,"DE RUDDER  Willy","KBCAW"]
[9066,"WILLEMS  Raymond","KBCAW"]
[9426,"DE WISPELAERE  Walter","KBCAW"]
[4036,"STRYPENS Lucien","KBCAW"]
[4609,"VAN ACKER Jan","KBCAW"]
[7045,"LAEREMANS Kenny","KBCAW"]
[7882,"Gandolfo Salvatore","KBCAW"]
[9260,"VAN HEIRSEELE Roger","KBCAW"]
[9054,"HOFMAN Hugo","KBCAW"]
[]
[4853,"NOPPE Robert","KGV"]
[4937,"LEEMANS Willy","KGV"]
[9276,"DE KORT Marc","KGV"]
[4865,"HAEGENS Willy","KGV"]
[4872,"VAN VOSSEL Danny","KGV"]
[5229,"VAN MELE Franky","KGV"]
[6117,"VAN VOSSELEN Christoph","KGV"]
[6712,"SEGERS Didier","KGV"]
[6784,"VAN BIESEN Tom","KGV"]
[8870,"VAN MEIRVENNE Nestor","KGV"]
[9082,"WAEM Kris","KGV"]
[1062,"DE WREEDE Marc","KGV"]
[5232,"CORNET Walther ","KGV"]
[9967,"VEYTS Sven","KGV","NS"]
[5230,"PAUWELS Paul","KGV"]
[6122,"DE MAEYER Joris","KGV"]
[8487,"APERE Ronny","KGV"]
[9587,"VAN GOETHEM Eric","KGV"]
[]
[8125,"LANDRIEU Jan","KK"]
[7308,"CLAUS Gino","KK"]
[9529,"CALLAERT Alain","KK"]
[4725,"VANONACKER Patrick","KK"]
[4736,"VANCOILLIE Francky","KK"]
[4737,"VANGANSBEKE Luc","KK"]
[4798,"VERCOUILLIE Alexander","KK"]
[8089,"VERGHEYNST Albert","KK"]
[4799,"VERCOUILLIE José","KK"]
[5223,"DESCHEPPER Carl","KK"]
[6730,"DENOULET Johan","KK"]
[7540,"VANDAELE Eric","KK"]
[8425,"MILLET Michel","KK"]
[4036,"VANGANSBEKE Gerard","KK"]
[8714,"LOOSVELDT Frank","KK"]
[9078,"BEKAERT Bernhard","KK"]
[4680,"RAVESTYN Martin","KK"]
[6727,"DE RYNCK Ivan","KK"]
[4703,"BEGHIN Frédéric","KK"]
[8159,"MONSOREZ Michel","KK"]
[4730,"LAGAGE Roger","KK"]
[2568,"CORNELISSEN Jacky","KK"]
[1054,"DEMOS Georges","KK"]
[4708,"DENNEULIN Frédéric","KK"]
[8324,"VANNUXEM Jérôme","KK"]
[7129,"ROELANTS Frédéric","KK"]
[5809,"BITALIS Richard","KK"]
[7457,"COECK Bjorn","KK"]
[7913,"STOPIN Gilles","KK"]
[1150,"BRANTS Ronny","KK"]
[1053,"DESPREZ Jean-Pierre","KK"]
[1059,"CARDON Eddy","KK"]
[3508,"BUYLE Stany","KK"]
[9530,"DESMET Alain","KK"]
[8696,"DORARD Steve","KK"]
[4589,"GODEFROIDT Frédéric","KK"]
[9968,"BRUYERE Michel","KK"]
[7401,"CHRISTIANI Dave","KK"]
[9767,"VANHULLE CHRIS","KK"]
[9779,"FLORENT JULIEN","KK"]
[1116,"DE BECKER JEAN-JACQUES","KK"]
[7468,"DE WEIRDT Jean-Pierre","KK"]
[4673,"LAGAT Michel","KK"]
[9742,"CARDON Steve","KK"]
[7468,"DEWEIRDT Jean-Pierre","KK"]
[4738,"VANDENDRIESSCHE Philip","KK"]
[9143,"DENEUT Johan","KK"]
[1056,"SANTY Eric","KK"]
[1058,"VERMEERSCH Dave","KK"]
[1329,"COENEN Philip","KK"]
[8001,"NICHELSON  Didier","KK","NS"]
[7997,"ROGIERS Jacques","KK","NS"]
[]
[2061,"MERTENS Eddy","KOH"]
[4290,"GILLADE Luc","KOH"]
[4305,"DE HERTOG Ives","KOH"]
[4354,"CAPIAU Lucien","KOH"]
[4356,"DE BOU Pol","KOH"]
[4361,"MANGELINCKX Nico","KOH"]
[4389,"VAN KERCKHOVE Andre","KOH"]
[8093,"MATTHYS Karolien","KOH"]
[8662,"VAN DER LINDEN Eric","KOH"]
[8871,"VANDENHENDE John","KOH"]
[9064,"GERSOULLE Marc","KOH"]
[9055,"DE HERTOG Gert-Jan","KOH"]
[4378,"DE RUYVER Stefaan ","KOH"]
[4387,"TEMMERMAN Walter","KOH"]
[9283,"BRENDERS Thierry","KOH"]
[4348,"VAN MUYLEM Norbert","KOH"]
[9518,"DE MECHELEER Michel","KOH"]
[4390,"VAN MALDER Dirk","KOH"]
[8066,"VANDERHAUWAERT Christian","KOH"]
[4780,"LIBRECHT Geert ","KOH"]
[7682,"MATHIEU Ivan","KOH"]
[4385,"MERTENS Marc","KOH"]
[1414,"VAN DIJCK Philip","KOH"]
[]
[4617,"JANSSENS Marcel","KOTM"]
[9129,"DE GRAAF Jackie","KOTM"]
[9777,"VAN ACKER Luc","KOTM"]
[9780,"DROSSAERT Maurice","KOTM"]
[8667,"Rogier Philppe","KOTM"]
[8661,"HEYNDRICKX Vik","KOTM"]
[]
[4158,"BAUWENS Freddy","OBA"]
[9253,"LINTHOUT Freddy","OBA"]
[1554,"VERLAECKE  Rudy","OBA"]
[4207,"VELGHE Stefaan","OBA"]
[4246,"BOLLE Jean-Marie","OBA"]
[4249,"BRISSINCK Danny","OBA"]
[4252,"DEJONGHE Freddy","OBA"]
[4254,"EVERAERT Luc","OBA"]
[4256,"HELSMOORTEL Rik","OBA"]
[4262,"SANCTORUM Daniel","OBA"]
[4263,"SCHLAPA Harald","OBA"]
[4264,"STEEN Gilbert","OBA"]
[4265,"STEMGEE Hugo","OBA"]
[4269,"TRATSAERT Daniel","OBA"]
[4276,"VAN WESEMAEL Walter","OBA"]
[4277,"VANDENBROUCKE Joel","OBA"]
[4635,"DEVLIEGER Raoul","OBA"]
[5900,"PUYSTIENS Stephan","OBA"]
[6456,"PLOVIE Herbert","OBA"]
[7466,"ROBYN Willy","OBA"]
[7800,"VERSCHUERE Guy","OBA"]
[7802,"DOUCHAMPS Olivier","OBA"]
[8296,"MAES Jozef","OBA"]
[8917,"GREMAIN Gino","OBA"]
["4162B","CAPPELLE Eddy","OBA"]
[4280,"ZONNEKEIN Henri","OBA"]
[4065,"BAERT Rony","OBA"]
[9296,"BORREMANS  Edouard","OBA"]
[9414,"EUSSEN Gerardus","OBA"]
[9977,"GOEMAERE Yves","OBA"]
[8045,"GARRE Roger","OBA"]
[9514,"VANROOSE Matteo","OBA"]
[9969,"SPILLIERS Marc","OBA"]
[7681,"VAN DE VELDE Jozef","OBA"]
[9989,"VAN BOGAERT  Marc","OBA"]
[9759,"BRACKX Daniël","OBA"]
[4193,"DEVYNCK Benoit","OBA"]
[6080,"ROELS Jan","OBA"]
[8885,"SPOORMANS Roger","OBA"]
[9993,"VAN DEN BERGEN Joêl","OBA"]
[7801,"EISCHEN Frédéric","OBA"]
[1376,"CEULEMANS Lodewijck","OBA"]
[2228,"VAN BENEDEN Alain","OBA"]
[4119,"GEERLANDT José","OBA"]
[4247,"BORNY Franky ","OBA"]
[2211,"DE TRENOYE Christian","OBA"]
[1209,"SOMERS Jan","OBA"]
[4268,"TOURLAMAIN Roger","OBA"]
[4301,"VAN GOETHEM Glenn","OBA"]
[4274,"VANHESTE Jean-Pierre"," OBA"]
[4122,"HAEGHEBAERT Eric","OS"]
[4133,"WERBROUCK Luc","OS"]
[7010,"VERMEULEN Johan","OS"]
[7287,"SOENENS Joël","OS"]
[8046,"LAMMENS Wilfried","OS"]
[8668,"VANDEKEERE Bert","OS"]
[8883,"VAN PRAET Bart","OS"]
[6074,"MAES Hendrik","OS"]
[1102,"CALLIAUW Ludo","OS"]
[9768,"VAN ROOSE Nico","OS"]
[9784,"DENYS Jerry","OS","NS"]
[7461,"GRIMON Johan","POCKET"]
[9534,"VANHONACKER Dominique","POCKET"]
[9953,"WILMS Steve","POCKET"]
[9954,"PETRUS Kim","POCKET"]
[]
[4416,"VAN RYSSELBERGHE Johan","QU"]
[4952,"DE SAEGER Dany","QU"]
[4516,"FEYS Gunter","QU"]
[4945,"BUYLE Hubert","QU"]
[4977,"VLERICK Dirk","QU"]
[6219,"RAEMDONCK Tommy","QU"]
[7530,"VLERICK Mathieu","QU"]
[8682,"TEMPELS André","QU"]
[9278,"BOONE Koen","QU"]
[9147,"BOCKLANDT Martin","QU"]
[4284,"DE BACKER Peter","QU"]
[9445,"DE PAEPE Dirk","QU"]
[9508,"HEYMAN David","QU"]
[9536,"BOONE Leo","QU"]
[4948,"DE BELEYR Gilbert","QU"]
[3439,"JORISSEN Jeffrey","QU"]
[4334,"VAN HAUTE Guido","QU"]
[9970,"VAN GOETHEM Wim","QU"]
[1204,"MERCKX Eddy","QU"]
[4910,"DE FLO Herman","QU"]
[4932,"VAN MOL William","QU"]
[4942,"BAETENS Marc","QU"]
[9427,"VANDENBERGHE  Glen","QU"]
[5747,"SAEY ETIENNE","QU"]
[4931,"VAN HOYLANDT ROGER","QU"]
[9956,"KASIER Sven","QU"]
[7318,"CARDON Eric","QU"]
[4908,"DE BOECK René","QU"]
[4639,"DUPONT Franky","QU"]
[1193,"DE SCHEPPER PATRICK","QU"]
[8639,"DE BOCK Dirk ","QU"]
[8590,"VAN DER SPIEGEL Marc","QU"]
[8582,"VAN NIEUWENHOVE Mario","QU"]
[8467,"ELSKENS Pierre","QU"]
[2204,"CLOET Marc","QU"]
[4550,"KESTELOOT Patrick","QU"]
[7995,"DANIELS Jean-Pierre","QU","NS"]
[7996,"HAMERS Guy","QU","NS"]
[7986,"VAN DER VORST Alain","QU","NS"]
[7978,"VAN ONDERBEREN Geert ","QU","NS"]
[]
[4702,"BEGHIN Bernard","RT"]
[4709,"DESBONNEZ Philippe","RT"]
[4710,"EQUIPART Pierre","RT"]
[4715,"LAMPE Guy","RT"]
[4740,"BEGHIN Julien","RT"]
[6441,"BERRIER Jean-Pierre","RT"]
[9075,"FLORIN Marc","RT"]
[9076,"DELPANQUE Fabien","RT"]
[9272,"GUENEZ Christophe","RT"]
[9435,"VERCAMPST Rémy","RT"]
[8694,"VANDEMAELE  Paul-André","RT"]
[7693,"FAREZ Luc","RT"]
[9528,"DE SOUSA Joaquim","RT"]
[4714,"LAMOTE Francis","RT"]
[9077,"COUCKE Gabriel","RT"]
[7542,"DESTAILLEUR Patrick ","RT"]
[9971,"DUEZ Bernard","RT"]
[]
[4294,"MATTENS Roger","SMA"]
[4301,"VAN GOETHEM Glenn","SMA"]
[7048,"STILTEN Rik","SMA"]
[4297,"VAN DEN BOSSCHE Christian","SMA"]
[9416,"RIEMKENS Wilfried","SMA"]
[9415,"VERHOEYEN Eddy","SMA"]
[9417,"ROGIERS Marc","SMA"]
[6694,"VINCK Eddy ","SMA"]
[1170,"TEMMERMAN Dirk","SMA"]
[4974,"VAN DEN BROECK Harry","SMA"]
[9972,"VAN DE VONDEL Dirk","SMA"]
[4374,"VERHULST Jean-Paul","SMA"]
[1190,"CALLEBAUT Pascal","SMA"]
[9808,"VAN DEN BOSSCHE Cesar","SMA"]
[9776,"VAN DEN BERGHE Damiaan","SMA"]
[2338,"VAN DE CAN Thierry","SMA"]
[7297,"MESKENS Eduard","SMA"]
[9776,"VANDE CAN Florian","SMA"]
[8675,"LEDEGEN  Johan","SMA","NS"]
[8673,"SOETINCK Patrick ","SMA","NS"]
[]
[]
[9821,"VAN DEN BOSSCHE Daniël","UN"]
[9063,"DE BECK Clery","UN"]
[4392,"BOELAERT Eddie","UN"]
[4399,"DIERKENS Antoine","UN"]
[4400,"LAMBOTTE Rik","UN"]
[4511,"DE PAUW Lucien","UN"]
[4514,"DUYTSCHAEVER Roger","UN"]
[4519,"MALFAIT Michel","UN"]
[4574,"HOFMAN Raf","UN"]
[4582,"VAN LIERDE Etienne","UN"]
[4583,"VAN SPEYBROECK Pierre","UN"]
[4965,"ROSSEL Bart","UN"]
[4966,"ROSSEL Francis","UN"]
[6930,"VERHELST Daniel","UN"]
[7471,"WIELEMANS Gustaaf","UN"]
[7808,"BAUWENS Filip","UN"]
[4531,"WULFRANCK Luc","UN"]
[8168,"VERWEE Julien","UN"]
[8660,"TEMMERMAN Eduard","UN"]
[9069,"SOMNEL Noël","UN"]
[9269,"GEIRNAERT Emile","UN"]
[4520,"MARTENS Johan","UN"]
[4581,"VAN HOOYDONK Guy","UN"]
[4552,"LEMAN Willy","UN"]
[8891,"PLATTEAU Tiani","UN"]
[9293,"VAN HIJFTE Frans","UN"]
[4732,"NACHTERGAELE Geert","UN"]
[4518,"LEURIDON Jean-Pierre","UN"]
[4456,"DUPONT Jean-Claude","UN"]
[4407,"STEELS Dieter","UN"]
[8064,"CNOCKAERT Arnold","UN"]
[4513,"DUYTSCHAEVER Peter","UN"]
[6433,"DE BACKER Luc","UN"]
[8148,"EVERAERT Santino","UN"]
[7914,"HUYBRECHT Daniël","UN"]
[7914,"HUYBRECHT Daniël","UN","NS"]
[]
[1063,"BERTOLOTTI  BEATRICE","WM"]
[5486,"BROEDERS ADRIANUS","WM"]
[7551,"CLAESSENS WALTER","WM"]
[8939,"CORNIL PASCAL","WM"]
[1188,"DE CLEEN JOERI","WM"]
[1189,"DE CLEEN SYLVAIN","WM"]
[8077,"DE WOLF ALFONS","WM"]
[4666,"DECONINCK FRANKY","WM"]
[1195,"DELVAUX BENONI","WM"]
[2215,"FORTON FRANCIS","WM"]
[8026,"HOFMAN Glen","WM"]
[1004,"HOSTENS STEFAAN","WM"]
[5430,"MUYLAERT DIRK","WM"]
[1005,"PEETERS LEO","WM"]
[4405,"SCHIETTECATTE YVES","WM"]
[2192,"STERCKVAL MICHEL","WM"]
[1168,"VAN BAREL FERDINAND","WM"]
[5727,"VAN GOETHEM BENNY","WM"]
[4842,"WAUTERS TOM","WM"]
[2206,"WEEREMANS DIRK","WM"]
[7521,"VERBERT Eddy","WM"]
[8254,"SOUMAGNE Pierre","WM"]
[6953,"DEWIT Anthony","WM"]
[6851,"ALLEMAN Marc","WM"]
[2292,"SLAGMOLEN FREDERIK","WM"]
[9775,"COLAERT René","WM"]
[9790,"DE MOL Eddy","WM"]
[2279,"DEWIT Freddy","WM"]
[9758,"WENSELAERS Frieda","WM"]
[6151,"VAN OVERSCHELDE Bonny","WM"]
[7926,"TACHOIRE Alain","WM","NS"]
[7928,"VAN ETTEN Sam","WM","NS"]
[]
[4691,"D'HONDT Hervé","WOH"]
[4701,"WERBROUCK Donald","WOH"]
[6722,"GRYSON Dirk","WOH"]
[7314,"DEMAN Leon","WOH"]
[7315,"EVERAERDT Corneel","WOH"]
[8528,"VANACKER Jozef","WOH"]
[8687,"DESWARTE Willy","WOH"]
[8872,"BEIRNAERT Arthur","WOH"]
[8875,"DEBUSSCHERE Dries","WOH"]
[9074,"VANBIERVLIET Geert","WOH"]
[9270,"DESWARTE Franky","WOH"]
[9271,"VAN ACKER Frank","WOH"]
[5183,"BOEDTS Freddy","WOH"]
[5717,"ACX Dirk","WOH"]
[9856,"ALGOET Marc","WOH"]
[]
[null," "]
[]
[]
[]
[]
[]
[]
[]
[]
[]
[]
[]
[]
[]
[]
[]
[]
[]
[]
[]
[]
[]
[]
[]
[null," "]
[]
[]
[]
[]
[]
[]
[]
[]
[]
[]
[]
[null," "]
[]
[]
[]
[]
[4487,"VAN DE VOORDE Luc"]
[6577,"SCIACCA Emilio"]
[1040,"SERGEANT Etienne"]
[9519,"HUT Joop"]
[5798,"van Manen Bert"]
[]
[9975,"WILLEMS Peter"]
[7685,"Hanskens Stephaan"]
[1044,"Coppens Jimmy"]
[]
[9594,"VAN QUAETHEM Romain"]
[]
[4528,"VAN HANEGEM Nico"]
[8889,"DE PREST Alex"]
[9423,"DE GOQUE Guy"]
[1039,"WIEME Koenraad"]
[1033,"DE CASTER Marc"]
[8426,"MOEYKENS Michel"]
[]
[8347,"BUYENS Pascal"]
[8886,"DELTENRE Pascal"]
[8887,"VANLANCKER Marc"]
[9523,"DE LANGHE François"]