{"text_format":"1","workbook":"xlsx","n_sheets":7,"sheets":["4°","4° ZF","Blad2","Blad3","databank","dataweb","LEDEN"],"not_rendered":{"charts":0,"images":0,"macros":0,"external_links":2,"defined_names":6,"comments":0,"pivot_tables":0},"unopened":[],"bounds":{"document_bytes":16777216,"sheet_cells":100000,"rows_first":2000,"rows_last":500,"rows_between":2000,"halvings":0,"cell_chars":16384,"cell_head_chars":4096},"cells_cut":0,"cells_raw":0,"read":"whole","date_system":"1900"}

{"sheet":"4°","index":0,"n_rows":66,"n_cols":32,"rows_kept":66,"cut":false,"hidden":false,"merged":[[60,1,60,11],[60,14,60,15],[60,16,60,17],[60,18,60,19],[60,20,60,21],[60,22,60,23],[60,24,60,25],[65,3,65,8],[58,1,58,2],[58,3,58,11],[58,14,58,15],[58,16,58,17],[58,18,58,19],[58,20,58,21],[58,22,58,23],[58,24,58,25],[59,1,59,2],[59,3,59,11],[59,14,59,15],[59,16,59,17],[59,18,59,19],[59,20,59,21],[59,22,59,23],[59,24,59,25],[56,1,56,2],[56,3,56,11],[56,14,56,15],[56,16,56,17],[56,18,56,19],[56,20,56,21],[56,22,56,23],[56,24,56,25],[57,1,57,2],[57,3,57,11],[57,14,57,15],[57,16,57,17],[57,18,57,19],[57,20,57,21],[57,22,57,23],[57,24,57,25],[53,1,53,11],[53,14,53,15],[53,16,53,17],[53,18,53,19],[53,20,53,21],[53,22,53,23],[53,24,53,25],[55,1,55,2],[55,3,55,11],[55,14,55,15],[55,16,55,17],[55,12,55,13],[51,1,51,2],[51,3,51,11],[51,14,51,15],[51,16,51,17],[51,18,51,19],[51,20,51,21],[51,22,51,23],[51,24,51,25],[52,1,52,2],[52,3,52,11],[52,14,52,15],[52,16,52,17],[52,18,52,19],[52,20,52,21],[52,22,52,23],[52,24,52,25],[49,20,49,21],[49,22,49,23],[49,24,49,25],[50,1,50,2],[50,3,50,11],[50,14,50,15],[50,16,50,17],[50,18,50,19],[50,20,50,21],[50,22,50,23],[50,24,50,25],[48,1,48,2],[48,3,48,11],[48,14,48,15],[48,16,48,17],[49,1,49,2],[49,3,49,11],[49,14,49,15],[49,16,49,17],[49,18,49,19],[48,12,48,13],[11,12,11,13],[4,0,4,26],[11,1,11,2],[9,3,9,11],[9,14,9,15],[9,16,9,17],[9,18,9,19],[9,20,9,21],[9,22,9,23],[9,1,9,2],[11,16,11,17],[9,12,9,13],[7,1,7,3],[6,22,6,23],[6,24,6,25],[7,22,7,23],[7,24,7,25],[6,16,6,17],[7,16,7,17],[11,14,11,15],[11,3,11,11],[11,18,11,19],[11,20,11,21],[11,22,11,23],[12,18,12,19],[13,18,13,19],[14,18,14,19],[15,18,15,19],[12,1,12,2],[14,1,14,2],[13,1,13,2],[15,1,15,2],[12,16,12,17],[13,16,13,17],[14,16,14,17],[15,16,15,17],[12,3,12,11],[13,3,13,11],[14,3,14,11],[15,3,15,11],[12,14,12,15],[13,14,13,15],[14,14,14,15],[15,14,15,15],[12,20,12,21],[13,20,13,21],[14,20,14,21],[15,20,15,21],[9,24,9,25],[12,22,12,23],[12,24,12,25],[13,22,13,23],[13,24,13,25],[11,24,11,25],[16,22,16,23],[16,24,16,25],[18,1,18,2],[18,3,18,11],[18,14,18,15],[18,16,18,17],[14,22,14,23],[14,24,14,25],[15,24,15,25],[15,22,15,23],[16,1,16,11],[16,14,16,15],[16,16,16,17],[16,18,16,19],[16,20,16,21],[18,12,18,13],[19,20,19,21],[19,22,19,23],[19,24,19,25],[20,1,20,2],[20,3,20,11],[20,14,20,15],[20,16,20,17],[20,18,20,19],[20,20,20,21],[19,1,19,2],[19,3,19,11],[19,14,19,15],[19,16,19,17],[19,18,19,19],[20,22,20,23],[20,24,20,25],[22,1,22,2],[22,3,22,11],[22,14,22,15],[22,16,22,17],[22,18,22,19],[22,20,22,21],[22,22,22,23],[22,24,22,25],[21,1,21,2],[21,3,21,11],[21,14,21,15],[21,16,21,17],[21,18,21,19],[21,20,21,21],[21,22,21,23],[21,24,21,25],[23,22,23,23],[23,24,23,25],[25,1,25,2],[25,3,25,11],[25,14,25,15],[25,16,25,17],[23,1,23,11],[23,14,23,15],[23,16,23,17],[23,18,23,19],[23,20,23,21],[25,12,25,13],[26,20,26,21],[26,22,26,23],[26,24,26,25],[27,1,27,2],[27,3,27,11],[27,14,27,15],[27,16,27,17],[27,18,27,19],[27,20,27,21],[26,1,26,2],[26,3,26,11],[26,14,26,15],[26,16,26,17],[26,18,26,19],[27,22,27,23],[27,24,27,25],[29,1,29,2],[29,3,29,11],[29,14,29,15],[29,16,29,17],[29,18,29,19],[29,20,29,21],[29,22,29,23],[29,24,29,25],[28,1,28,2],[28,3,28,11],[28,14,28,15],[28,16,28,17],[28,18,28,19],[28,20,28,21],[28,22,28,23],[28,24,28,25],[30,22,30,23],[30,24,30,25],[32,1,32,2],[32,3,32,11],[32,14,32,15],[32,16,32,17],[30,1,30,11],[30,14,30,15],[30,16,30,17],[30,18,30,19],[30,20,30,21],[32,12,32,13],[33,20,33,21],[33,22,33,23],[33,24,33,25],[34,1,34,2],[34,3,34,11],[34,14,34,15],[34,16,34,17],[34,18,34,19],[34,20,34,21],[33,1,33,2],[33,3,33,11],[33,14,33,15],[33,16,33,17],[33,18,33,19],[34,22,34,23],[34,24,34,25],[36,1,36,2],[36,3,36,11],[36,14,36,15],[36,16,36,17],[36,18,36,19],[36,20,36,21],[36,22,36,23],[36,24,36,25],[35,1,35,2],[35,3,35,11],[35,14,35,15],[35,16,35,17],[35,18,35,19],[35,20,35,21],[35,22,35,23],[35,24,35,25],[37,22,37,23],[37,24,37,25],[39,1,39,2],[39,3,39,11],[39,14,39,15],[39,16,39,17],[37,1,37,11],[37,14,37,15],[37,16,37,17],[37,18,37,19],[37,20,37,21],[39,12,39,13],[40,20,40,21],[40,22,40,23],[40,24,40,25],[41,1,41,2],[41,3,41,11],[41,14,41,15],[41,16,41,17],[41,18,41,19],[41,20,41,21],[40,1,40,2],[40,3,40,11],[40,14,40,15],[40,16,40,17],[40,18,40,19],[41,22,41,23],[41,24,41,25],[44,18,44,19],[44,20,44,21],[42,24,42,25],[43,1,43,2],[43,3,43,11],[43,14,43,15],[43,16,43,17],[43,18,43,19],[43,20,43,21],[43,22,43,23],[43,24,43,25],[42,1,42,2],[42,3,42,11],[42,14,42,15],[42,16,42,17],[42,18,42,19],[42,20,42,21],[42,22,42,23],[44,22,44,23],[44,24,44,25],[44,1,44,11],[44,14,44,15],[44,16,44,17]]}
["K O N I N K L I J K E   B E L G I S C H E    B I L J A R T B O N D ",null,null,null,null,null,null,null,null,null,null,null,null,"-","F E D E R A T I O N  R O Y A L E   B E L G E  DE  B I L L A R D "]
[null,null,null,null,null,"VZW - Zetel -  \" Marie Thérèse \" - Martelarenplein, 1  -  3000 Leuven"]
[null,null,null,null,"GEWEST  BEIDE  VLAANDEREN"]
[null,null,null,null,null,null,null,null,null,null,null,"2019 - 2020"]
["UITSLAG GEWESTFINALE   4°  :    KLASSE   VRIJSPEL MB "]
[]
[null,"Inrichting : ",null,null,"ACADEMIE CENTRUM GENT ",null,null,null,null,null,null,null,null,null,null,null,"TSP",null,null,null,null,null,"MIN",null,"MAX"]
[null,"datum  : ",null,null,"zondag, 3 november 2019",null,null,null,null,null,null,null,null,null,null,null,60,null,null,null,null,null,3,null,5]
[]
[null,"NATID",null,"NAAM ",null,null,null,null,null,null,null,null,"CLUB",null,"WEDP",null,"BP",null,"Beurten",null,"GEM",null,"HR",null,"OPM",null,"Pl"]
[]
[null,6428,null,{"$f":"VLOOKUP(B12,LEDEN!A:B,2,FALSE)","v":"MEULEMAN Rudy"},null,null,null,null,null,null,null,null,{"$f":"VLOOKUP(B12,LEDEN!A:C,3,FALSE)","v":"ACG"}]
[null,8672,null,{"$f":"VLOOKUP(B13,LEDEN!A:B,2,FALSE)","v":"DEMOOR Danny"},null,null,null,null,null,null,null,null,null,null,2,null,60,null,13,null,{"$f":"IF(S13=0,\" \",TRUNC(Q13/S13,2))","v":4.6100000000000003},null,22,null,{"$f":"IF(Q13=0,\"\",IF(U13>=AD13,\"PR\",IF(U13<AC13,\"OG\",\"MG\")))","v":"MG"},null,null,null,3,4.99]
[null,6713,null,{"$f":"VLOOKUP(B14,LEDEN!A:B,2,FALSE)","v":"VAN ACKER Johan"},null,null,null,null,null,null,null,null,null,null,2,null,60,null,13,null,{"$f":"IF(S14=0,\" \",TRUNC(Q14/S14,2))","v":4.6100000000000003},null,19,null,{"$f":"IF(Q14=0,\"\", IF(U14>=AD14,\"PR\",IF(U14<AC14,\"OG\",\"MG\")))","v":"MG"},null,null,null,3,4.99,null,"  "]
[null,7010,null,{"$f":"VLOOKUP(B15,LEDEN!A:B,2,FALSE)","v":"VERMEULEN Johan"},null,null,null,null,null,null,null,null,null,null,2,null,60,null,18,null,{"$f":"IF(S15=0,\" \",TRUNC(Q15/S15,2))","v":3.33},null,15,null,{"$f":"IF(Q15=0,\"\", IF(U15>=AD15,\"PR\",IF(U15<AC15,\"OG\",\"MG\")))","v":"MG"},null,null,null,3,4.99]
{"$rows_left_out":52}
{"sheet":"4° ZF","index":1,"n_rows":66,"n_cols":32,"rows_kept":66,"cut":false,"hidden":false,"merged":[[60,24,60,25],[65,3,65,8],[11,18,11,19],[11,20,11,21],[11,22,11,23],[11,24,11,25],[60,1,60,11],[60,14,60,15],[60,16,60,17],[60,18,60,19],[60,20,60,21],[60,22,60,23],[58,22,58,23],[58,24,58,25],[59,1,59,2],[59,3,59,11],[59,14,59,15],[59,16,59,17],[59,18,59,19],[59,20,59,21],[59,22,59,23],[59,24,59,25],[58,1,58,2],[58,3,58,11],[58,14,58,15],[58,16,58,17],[58,18,58,19],[58,20,58,21],[56,22,56,23],[56,24,56,25],[57,1,57,2],[57,3,57,11],[57,14,57,15],[57,16,57,17],[57,18,57,19],[57,20,57,21],[57,22,57,23],[57,24,57,25],[56,1,56,2],[56,3,56,11],[56,14,56,15],[56,16,56,17],[56,18,56,19],[56,20,56,21],[53,24,53,25],[55,1,55,2],[55,3,55,11],[55,12,55,13],[55,14,55,15],[55,16,55,17],[53,1,53,11],[53,14,53,15],[53,16,53,17],[53,18,53,19],[53,20,53,21],[53,22,53,23],[51,22,51,23],[51,24,51,25],[52,1,52,2],[52,3,52,11],[52,14,52,15],[52,16,52,17],[52,18,52,19],[52,20,52,21],[52,22,52,23],[52,24,52,25],[51,1,51,2],[51,3,51,11],[51,14,51,15],[51,16,51,17],[51,18,51,19],[51,20,51,21],[49,22,49,23],[49,24,49,25],[50,1,50,2],[50,3,50,11],[50,14,50,15],[50,16,50,17],[50,18,50,19],[50,20,50,21],[50,22,50,23],[50,24,50,25],[49,1,49,2],[49,3,49,11],[49,14,49,15],[49,16,49,17],[49,18,49,19],[49,20,49,21],[44,24,44,25],[48,1,48,2],[48,3,48,11],[48,12,48,13],[48,14,48,15],[48,16,48,17],[44,1,44,11],[44,14,44,15],[44,16,44,17],[44,18,44,19],[44,20,44,21],[44,22,44,23],[42,22,42,23],[42,24,42,25],[43,1,43,2],[43,3,43,11],[43,14,43,15],[43,16,43,17],[43,18,43,19],[43,20,43,21],[43,22,43,23],[43,24,43,25],[42,1,42,2],[42,3,42,11],[42,14,42,15],[42,16,42,17],[42,18,42,19],[42,20,42,21],[40,22,40,23],[40,24,40,25],[41,1,41,2],[41,3,41,11],[41,14,41,15],[41,16,41,17],[41,18,41,19],[41,20,41,21],[41,22,41,23],[41,24,41,25],[40,1,40,2],[40,3,40,11],[40,14,40,15],[40,16,40,17],[40,18,40,19],[40,20,40,21],[37,24,37,25],[39,1,39,2],[39,3,39,11],[39,12,39,13],[39,14,39,15],[39,16,39,17],[37,1,37,11],[37,14,37,15],[37,16,37,17],[37,18,37,19],[37,20,37,21],[37,22,37,23],[35,22,35,23],[35,24,35,25],[36,1,36,2],[36,3,36,11],[36,14,36,15],[36,16,36,17],[36,18,36,19],[36,20,36,21],[36,22,36,23],[36,24,36,25],[35,1,35,2],[35,3,35,11],[35,14,35,15],[35,16,35,17],[35,18,35,19],[35,20,35,21],[33,22,33,23],[33,24,33,25],[34,1,34,2],[34,3,34,11],[34,14,34,15],[34,16,34,17],[34,18,34,19],[34,20,34,21],[34,22,34,23],[34,24,34,25],[33,1,33,2],[33,3,33,11],[33,14,33,15],[33,16,33,17],[33,18,33,19],[33,20,33,21],[30,24,30,25],[32,1,32,2],[32,3,32,11],[32,12,32,13],[32,14,32,15],[32,16,32,17],[30,1,30,11],[30,14,30,15],[30,16,30,17],[30,18,30,19],[30,20,30,21],[30,22,30,23],[28,22,28,23],[28,24,28,25],[29,1,29,2],[29,3,29,11],[29,14,29,15],[29,16,29,17],[29,18,29,19],[29,20,29,21],[29,22,29,23],[29,24,29,25],[28,1,28,2],[28,3,28,11],[28,14,28,15],[28,16,28,17],[28,18,28,19],[28,20,28,21],[26,22,26,23],[26,24,26,25],[27,1,27,2],[27,3,27,11],[27,14,27,15],[27,16,27,17],[27,18,27,19],[27,20,27,21],[27,22,27,23],[27,24,27,25],[26,1,26,2],[26,3,26,11],[26,14,26,15],[26,16,26,17],[26,18,26,19],[26,20,26,21],[23,24,23,25],[25,1,25,2],[25,3,25,11],[25,12,25,13],[25,14,25,15],[25,16,25,17],[23,1,23,11],[23,14,23,15],[23,16,23,17],[23,18,23,19],[23,20,23,21],[23,22,23,23],[21,22,21,23],[21,24,21,25],[22,1,22,2],[22,3,22,11],[22,14,22,15],[22,16,22,17],[22,18,22,19],[22,20,22,21],[22,22,22,23],[22,24,22,25],[21,1,21,2],[21,3,21,11],[21,14,21,15],[21,16,21,17],[21,18,21,19],[21,20,21,21],[19,22,19,23],[19,24,19,25],[20,1,20,2],[20,3,20,11],[20,14,20,15],[20,16,20,17],[20,18,20,19],[20,20,20,21],[20,22,20,23],[20,24,20,25],[19,1,19,2],[19,3,19,11],[19,14,19,15],[19,16,19,17],[19,18,19,19],[19,20,19,21],[16,24,16,25],[18,1,18,2],[18,3,18,11],[18,12,18,13],[18,14,18,15],[18,16,18,17],[16,1,16,11],[16,14,16,15],[16,16,16,17],[16,18,16,19],[16,20,16,21],[16,22,16,23],[14,22,14,23],[14,24,14,25],[15,1,15,2],[15,3,15,11],[15,14,15,15],[15,16,15,17],[15,18,15,19],[15,20,15,21],[15,22,15,23],[15,24,15,25],[14,1,14,2],[14,3,14,11],[14,14,14,15],[14,16,14,17],[14,18,14,19],[14,20,14,21],[12,22,12,23],[12,24,12,25],[13,1,13,2],[13,3,13,11],[13,14,13,15],[13,16,13,17],[13,18,13,19],[13,20,13,21],[13,22,13,23],[13,24,13,25],[12,1,12,2],[12,3,12,11],[12,14,12,15],[12,16,12,17],[12,18,12,19],[12,20,12,21],[11,1,11,2],[11,3,11,11],[11,12,11,13],[11,14,11,15],[11,16,11,17],[9,1,9,2],[9,3,9,11],[9,12,9,13],[9,14,9,15],[9,16,9,17],[4,0,4,26],[6,16,6,17],[6,22,6,23],[6,24,6,25],[7,1,7,3],[7,16,7,17],[7,22,7,23],[7,24,7,25],[9,20,9,21],[9,22,9,23],[9,24,9,25],[9,18,9,19]]}
["K O N I N K L I J K E   B E L G I S C H E    B I L J A R T B O N D ",null,null,null,null,null,null,null,null,null,null,null,null,"-","F E D E R A T I O N  R O Y A L E   B E L G E  DE  B I L L A R D "]
[null,null,null,null,null,"VZW - Zetel -  \" Marie Thérèse \" - Martelarenplein, 1  -  3000 Leuven"]
[null,null,null,null,"GEWEST  BEIDE  VLAANDEREN"]
[null,null,null,null,null,null,null,null,null,null,null,"2019 - 2020"]
["UITSLAG GEWESTFINALE   4°  :    KLASSE   VRIJSPEL MB "]
[]
[null,"Inrichting : ",null,null,"ACADEMIE CENTRUM GENT ",null,null,null,null,null,null,null,null,null,null,null,"TSP",null,null,null,null,null,"MIN",null,"MAX"]
[null,"datum  : ",null,null,"zondag, 3 november 2019",null,null,null,null,null,null,null,null,null,null,null,60,null,null,null,null,null,3,null,5]
[]
[null,"NATID",null,"NAAM ",null,null,null,null,null,null,null,null,"CLUB",null,"WEDP",null,"BP",null,"Beurten",null,"GEM",null,"HR",null,"OPM",null,"Pl"]
[]
[null,6428,null,{"$f":"VLOOKUP(B12,LEDEN!A:B,2,FALSE)","v":"MEULEMAN Rudy"},null,null,null,null,null,null,null,null,{"$f":"VLOOKUP(B12,LEDEN!A:C,3,FALSE)","v":"ACG"}]
[null,8672,null,{"$f":"VLOOKUP(B13,LEDEN!A:B,2,FALSE)","v":"DEMOOR Danny"},null,null,null,null,null,null,null,null,null,null,null,null,null,null,null,null,{"$f":"IF(S13=0,\" \",TRUNC(Q13/S13,2))","v":" "},null,null,null,{"$f":"IF(Q13=0,\"\",IF(U13>=AD13,\"PR\",IF(U13<AC13,\"OG\",\"MG\")))","v":""},null,null,null,3,4.99]
[null,null,null,null,null,null,null,null,null,null,null,null,null,null,null,null,null,null,null,null,{"$f":"IF(S14=0,\" \",TRUNC(Q14/S14,2))","v":" "},null,null,null,{"$f":"IF(Q14=0,\"\", IF(U14>=AD14,\"PR\",IF(U14<AC14,\"OG\",\"MG\")))","v":""},null,null,null,3,4.99,null,"  "]
[null,null,null,null,null,null,null,null,null,null,null,null,null,null,null,null,null,null,null,null," ",null,null,null,{"$f":"IF(Q15=0,\"\", IF(U15>=AD15,\"PR\",IF(U15<AC15,\"OG\",\"MG\")))","v":""},null,null,null,3,4.99]
{"$rows_left_out":52}
{"sheet":"Blad2","index":2,"n_rows":0,"n_cols":0,"rows_kept":0,"cut":false,"hidden":false,"merged":[]}

{"sheet":"Blad3","index":3,"n_rows":0,"n_cols":0,"rows_kept":0,"cut":false,"hidden":false,"merged":[]}

{"sheet":"databank","index":4,"n_rows":21,"n_cols":10,"rows_kept":21,"cut":false,"hidden":false,"merged":[]}
["competitie","NATID","CODESPORTJAAR","CODESOORT","CODECAT","CODEOPM","CODEDISCIPLINE","CODEFORMAAT","GEM","NCAT"]
[null,{"$f":"[2]Blad2!B1","v":0},24,{"$f":"[2]Blad2!E1","v":5},{"$f":"[2]Blad2!F1","v":5},{"$f":"[2]Blad2!H1","v":{"$error":"#DIV/0!"}},{"$f":"[2]Blad2!I1","v":1},2,{"$f":"[2]Blad2!K1","v":{"$error":"#DIV/0!"}},{"$f":"[2]Blad2!L1","v":{"$error":"#DIV/0!"}}]
["GWVOORRONDE",{"$f":"[2]Blad2!B2","v":0},24,{"$f":"[2]Blad2!E2","v":5},{"$f":"[2]Blad2!F2","v":5},{"$f":"[2]Blad2!H2","v":{"$error":"#DIV/0!"}},{"$f":"[2]Blad2!I2","v":1},2,{"$f":"[2]Blad2!K2","v":{"$error":"#DIV/0!"}},{"$f":"[2]Blad2!L2","v":{"$error":"#DIV/0!"}}]
["GWVOORRONDE",{"$f":"[2]Blad2!B3","v":0},24,{"$f":"[2]Blad2!E3","v":5},{"$f":"[2]Blad2!F3","v":5},{"$f":"[2]Blad2!H3","v":{"$error":"#DIV/0!"}},{"$f":"[2]Blad2!I3","v":1},2,{"$f":"[2]Blad2!K3","v":{"$error":"#DIV/0!"}},{"$f":"[2]Blad2!L3","v":{"$error":"#DIV/0!"}}]
["GWVOORRONDE",{"$f":"[2]Blad2!B4","v":0},24,{"$f":"[2]Blad2!E4","v":5},{"$f":"[2]Blad2!F4","v":5},{"$f":"[2]Blad2!H4","v":{"$error":"#DIV/0!"}},{"$f":"[2]Blad2!I4","v":1},2,{"$f":"[2]Blad2!K4","v":{"$error":"#DIV/0!"}},{"$f":"[2]Blad2!L4","v":{"$error":"#DIV/0!"}}]
["GWVOORRONDE",{"$f":"[2]Blad2!B5","v":0},24,{"$f":"[2]Blad2!E5","v":5},{"$f":"[2]Blad2!F5","v":5},{"$f":"[2]Blad2!H5","v":{"$error":"#DIV/0!"}},{"$f":"[2]Blad2!I5","v":1},2,{"$f":"[2]Blad2!K5","v":{"$error":"#DIV/0!"}},{"$f":"[2]Blad2!L5","v":{"$error":"#DIV/0!"}}]
["GWVOORRONDE",{"$f":"[2]Blad2!B6","v":0},24,{"$f":"[2]Blad2!E6","v":5},{"$f":"[2]Blad2!F6","v":5},{"$f":"[2]Blad2!H6","v":{"$error":"#DIV/0!"}},{"$f":"[2]Blad2!I6","v":1},2,{"$f":"[2]Blad2!K6","v":{"$error":"#DIV/0!"}},{"$f":"[2]Blad2!L6","v":{"$error":"#DIV/0!"}}]
[]
["GWVOORRONDE",{"$f":"[2]Blad2!B8","v":0},24,{"$f":"[2]Blad2!E8","v":5},{"$f":"[2]Blad2!F8","v":6},{"$f":"[2]Blad2!H8","v":{"$error":"#DIV/0!"}},{"$f":"[2]Blad2!I8","v":1},2,{"$f":"[2]Blad2!K8","v":{"$error":"#DIV/0!"}},{"$f":"[2]Blad2!L8","v":{"$error":"#DIV/0!"}}]
["GWVOORRONDE",{"$f":"[2]Blad2!B9","v":0},24,{"$f":"[2]Blad2!E9","v":5},{"$f":"[2]Blad2!F9","v":6},{"$f":"[2]Blad2!H9","v":{"$error":"#DIV/0!"}},{"$f":"[2]Blad2!I9","v":1},2,{"$f":"[2]Blad2!K9","v":{"$error":"#DIV/0!"}},{"$f":"[2]Blad2!L9","v":{"$error":"#DIV/0!"}}]
["GWVOORRONDE",{"$f":"[2]Blad2!B10","v":0},24,{"$f":"[2]Blad2!E10","v":5},{"$f":"[2]Blad2!F10","v":6},{"$f":"[2]Blad2!H10","v":{"$error":"#DIV/0!"}},{"$f":"[2]Blad2!I10","v":1},2,{"$f":"[2]Blad2!K10","v":{"$error":"#DIV/0!"}},{"$f":"[2]Blad2!L10","v":{"$error":"#DIV/0!"}}]
["GWVOORRONDE",{"$f":"[2]Blad2!B11","v":0},24,{"$f":"[2]Blad2!E11","v":5},{"$f":"[2]Blad2!F11","v":6},{"$f":"[2]Blad2!H11","v":{"$error":"#DIV/0!"}},{"$f":"[2]Blad2!I11","v":1},2,{"$f":"[2]Blad2!K11","v":{"$error":"#DIV/0!"}},{"$f":"[2]Blad2!L11","v":{"$error":"#DIV/0!"}}]
["GWVOORRONDE",{"$f":"[2]Blad2!B12","v":0},24,{"$f":"[2]Blad2!E12","v":5},{"$f":"[2]Blad2!F12","v":6},{"$f":"[2]Blad2!H12","v":{"$error":"#DIV/0!"}},{"$f":"[2]Blad2!I12","v":1},2,{"$f":"[2]Blad2!K12","v":{"$error":"#DIV/0!"}},{"$f":"[2]Blad2!L12","v":{"$error":"#DIV/0!"}}]
["GWVOORRONDE",{"$f":"[2]Blad2!B13","v":0},24,{"$f":"[2]Blad2!E13","v":5},{"$f":"[2]Blad2!F13","v":6},{"$f":"[2]Blad2!H13","v":{"$error":"#DIV/0!"}},{"$f":"[2]Blad2!I13","v":1},2,{"$f":"[2]Blad2!K13","v":{"$error":"#DIV/0!"}},{"$f":"[2]Blad2!L13","v":{"$error":"#DIV/0!"}}]
[]
{"$rows_left_out":7}
{"sheet":"dataweb","index":5,"n_rows":28,"n_cols":36,"rows_kept":28,"cut":false,"hidden":false,"merged":[]}
["Lic","CLUB-ID","CLUBNAAM","NAAM SPELER",null,null,null,null,null,null,null,null,null,null,null,null,null,null,null,null,null,null,null,null,null,"VKP15","VK15G","VK15OPM","VK15NP"]
[{"$f":"[2]Blad2!B1","v":0},null,null,{"$f":"[2]SAMENVATTING!B9","v":{"$error":"#N/A"}},null,null,null,null,null,null,null,null,null,null,null,null,null,null,null,null,null,null,null,null,null,{"$f":"IF(LEN(AE2)>0,HLOOKUP(AE2,$E$23:$AG$24,2,0))","v":60},{"$f":"[2]SAMENVATTING!J9","v":{"$error":"#DIV/0!"}},{"$f":"IF(LEN(AG2)>0,HLOOKUP(AG2,$E$27:$AD$28,2,0))","v":{"$error":"#DIV/0!"}},{"$f":"IF(LEN(AF2)>0,HLOOKUP(AF2,$E$23:$AG$24,2,0))","v":{"$error":"#DIV/0!"}},null,{"$f":"databank!E2","v":5},{"$f":"databank!J2","v":{"$error":"#DIV/0!"}},{"$f":"databank!F2","v":{"$error":"#DIV/0!"}}]
[{"$f":"[2]Blad2!B2","v":0},null,null,{"$f":"[2]SAMENVATTING!B10","v":{"$error":"#N/A"}},null,null,null,null,null,null,null,null,null,null,null,null,null,null,null,null,null,null,null,null,null,60,{"$f":"[2]SAMENVATTING!J10","v":{"$error":"#DIV/0!"}},{"$error":"#DIV/0!"},{"$error":"#DIV/0!"},null,{"$f":"databank!E3","v":5},{"$f":"databank!J3","v":{"$error":"#DIV/0!"}},{"$f":"databank!F3","v":{"$error":"#DIV/0!"}}]
[{"$f":"[2]Blad2!B3","v":0},null,null,{"$f":"[2]SAMENVATTING!B11","v":{"$error":"#N/A"}},null,null,null,null,null,null,null,null,null,null,null,null,null,null,null,null,null,null,null,null,null,60,{"$f":"[2]SAMENVATTING!J11","v":{"$error":"#DIV/0!"}},{"$error":"#DIV/0!"},{"$error":"#DIV/0!"},null,{"$f":"databank!E4","v":5},{"$f":"databank!J4","v":{"$error":"#DIV/0!"}},{"$f":"databank!F4","v":{"$error":"#DIV/0!"}}]
[{"$f":"[2]Blad2!B4","v":0},null,null,{"$f":"[2]SAMENVATTING!B12","v":{"$error":"#N/A"}},null,null,null,null,null,null,null,null,null,null,null,null,null,null,null,null,null,null,null,null,null,60,{"$f":"[2]SAMENVATTING!J12","v":{"$error":"#DIV/0!"}},{"$error":"#DIV/0!"},{"$error":"#DIV/0!"},null,{"$f":"databank!E5","v":5},{"$f":"databank!J5","v":{"$error":"#DIV/0!"}},{"$f":"databank!F5","v":{"$error":"#DIV/0!"}}]
[{"$f":"[2]Blad2!B5","v":0},null,null,{"$f":"[2]SAMENVATTING!B13","v":{"$error":"#N/A"}},null,null,null,null,null,null,null,null,null,null,null,null,null,null,null,null,null,null,null,null,null,60,{"$f":"[2]SAMENVATTING!J13","v":{"$error":"#DIV/0!"}},{"$error":"#DIV/0!"},{"$error":"#DIV/0!"},null,{"$f":"databank!E6","v":5},{"$f":"databank!J6","v":{"$error":"#DIV/0!"}},{"$f":"databank!F6","v":{"$error":"#DIV/0!"}}]
[{"$f":"[2]Blad2!B6","v":0},null,null,{"$f":"[2]SAMENVATTING!B14","v":{"$error":"#N/A"}},null,null,null,null,null,null,null,null,null,null,null,null,null,null,null,null,null,null,null,null,null,60,{"$f":"[2]SAMENVATTING!J14","v":{"$error":"#DIV/0!"}},{"$error":"#DIV/0!"},{"$error":"#DIV/0!"},null,{"$f":"databank!E7","v":5},{"$f":"databank!J7","v":{"$error":"#DIV/0!"}},{"$f":"databank!F7","v":{"$error":"#DIV/0!"}}]
[]
[{"$f":"[2]Blad2!B8","v":0},null,null,{"$f":"[2]SAMENVATTING!B16","v":{"$error":"#N/A"}},null,null,null,null,null,null,null,null,null,null,null,null,null,null,null,null,null,null,null,null,null,{"$f":"IF(LEN(AE9)>0,HLOOKUP(AE9,$E$23:$AG$24,2,0))","v":90},{"$f":"[2]SAMENVATTING!J16","v":{"$error":"#DIV/0!"}},{"$f":"IF(LEN(AG9)>0,HLOOKUP(AG9,$E$27:$AD$28,2,0))","v":{"$error":"#DIV/0!"}},{"$f":"IF(LEN(AF9)>0,HLOOKUP(AF9,$E$23:$AG$24,2,0))","v":{"$error":"#DIV/0!"}},null,{"$f":"databank!E9","v":6},{"$f":"databank!J9","v":{"$error":"#DIV/0!"}},{"$f":"databank!F9","v":{"$error":"#DIV/0!"}}]
[{"$f":"[2]Blad2!B9","v":0},null,null,{"$f":"[2]SAMENVATTING!B17","v":{"$error":"#N/A"}},null,null,null,null,null,null,null,null,null,null,null,null,null,null,null,null,null,null,null,null,null,90,{"$f":"[2]SAMENVATTING!J17","v":{"$error":"#DIV/0!"}},{"$error":"#DIV/0!"},{"$error":"#DIV/0!"},null,{"$f":"databank!E10","v":6},{"$f":"databank!J10","v":{"$error":"#DIV/0!"}},{"$f":"databank!F10","v":{"$error":"#DIV/0!"}}]
[{"$f":"[2]Blad2!B10","v":0},null,null,{"$f":"[2]SAMENVATTING!B18","v":{"$error":"#N/A"}},null,null,null,null,null,null,null,null,null,null,null,null,null,null,null,null,null,null,null,null,null,90,{"$f":"[2]SAMENVATTING!J18","v":{"$error":"#DIV/0!"}},{"$error":"#DIV/0!"},{"$error":"#DIV/0!"},null,{"$f":"databank!E11","v":6},{"$f":"databank!J11","v":{"$error":"#DIV/0!"}},{"$f":"databank!F11","v":{"$error":"#DIV/0!"}}]
[{"$f":"[2]Blad2!B11","v":0},null,null,{"$f":"[2]SAMENVATTING!B19","v":{"$error":"#N/A"}},null,null,null,null,null,null,null,null,null,null,null,null,null,null,null,null,null,null,null,null,null,90,{"$f":"[2]SAMENVATTING!J19","v":{"$error":"#DIV/0!"}},{"$error":"#DIV/0!"},{"$error":"#DIV/0!"},null,{"$f":"databank!E12","v":6},{"$f":"databank!J12","v":{"$error":"#DIV/0!"}},{"$f":"databank!F12","v":{"$error":"#DIV/0!"}}]
[{"$f":"[2]Blad2!B12","v":0},null,null,{"$f":"[2]SAMENVATTING!B20","v":{"$error":"#N/A"}},null,null,null,null,null,null,null,null,null,null,null,null,null,null,null,null,null,null,null,null,null,90,{"$f":"[2]SAMENVATTING!J20","v":{"$error":"#DIV/0!"}},{"$error":"#DIV/0!"},{"$error":"#DIV/0!"},null,{"$f":"databank!E13","v":6},{"$f":"databank!J13","v":{"$error":"#DIV/0!"}},{"$f":"databank!F13","v":{"$error":"#DIV/0!"}}]
[{"$f":"[2]Blad2!B13","v":0},null,null,{"$f":"[2]SAMENVATTING!B21","v":{"$error":"#N/A"}},null,null,null,null,null,null,null,null,null,null,null,null,null,null,null,null,null,null,null,null,null,90,{"$f":"[2]SAMENVATTING!J21","v":{"$error":"#DIV/0!"}},{"$error":"#DIV/0!"},{"$error":"#DIV/0!"},null,{"$f":"databank!E14","v":6},{"$f":"databank!J14","v":{"$error":"#DIV/0!"}},{"$f":"databank!F14","v":{"$error":"#DIV/0!"}}]
[]
{"$rows_left_out":14}
{"sheet":"LEDEN","index":6,"n_rows":858,"n_cols":4,"rows_kept":858,"cut":false,"hidden":false,"merged":[]}
[null,null,null,"NS"]
[8758,"DUYM Ignace","ACG"]
[4505,"BRACKE Peter","ACG"]
[2314,"SONCK ROBBY","ACG"]
[6927,"DUJARDIN Luc","ACG"]
[4432,"BAETE Jean-Pierre","ACG"]
[6705,"BERNAERDT Roland","ACG"]
[4496,"VAN HANEGEM Izaak","ACG"]
[7125,"Nuytten Renold","ACG"]
[7302,"DE CRAECKER Werner","ACG"]
[9800,"DE CRAECKER Emma (jeugd)","ACG"]
[9826,"DE BIE Rudy","ACG"]
[9261,"de MEULEMEESTER Cédric","ACG"]
[1036,"DEPOORTER MIEKE","ACG"]
[5587,"GERMONPRE Luc","ACG"]
{"$rows_left_out":843}