{"text_format":"1","workbook":"xlsx","n_sheets":3,"sheets":["EXC","EXC zf","LEDEN"],"not_rendered":{"charts":0,"images":0,"macros":1,"external_links":1,"defined_names":6,"comments":0,"pivot_tables":0},"unopened":[],"bounds":{"document_bytes":16777216,"sheet_cells":100000,"rows_first":2000,"rows_last":500,"rows_between":2000,"halvings":0,"cell_chars":16384,"cell_head_chars":4096},"cells_cut":0,"cells_raw":0,"read":"whole","date_system":"1900"}

{"sheet":"EXC","index":0,"n_rows":49,"n_cols":32,"rows_kept":49,"cut":false,"hidden":false,"merged":[[48,3,48,9],[48,15,48,20],[45,1,45,10],[45,18,45,19],[42,2,42,10],[42,18,42,19],[43,2,43,10],[43,18,43,19],[44,2,44,10],[44,18,44,19],[40,2,40,10],[40,11,40,12],[41,2,41,10],[41,18,41,19],[33,2,33,10],[33,11,33,12],[34,2,34,10],[34,18,34,19],[35,2,35,10],[35,18,35,19],[36,2,36,10],[36,18,36,19],[37,2,37,10],[37,18,37,19],[38,1,38,10],[38,18,38,19],[29,2,29,10],[29,18,29,19],[30,2,30,10],[30,18,30,19],[31,1,31,10],[31,18,31,19],[26,2,26,10],[26,11,26,12],[27,2,27,10],[27,18,27,19],[28,2,28,10],[28,18,28,19],[22,2,22,10],[22,18,22,19],[23,2,23,10],[23,18,23,19],[24,1,24,10],[24,18,24,19],[19,2,19,10],[19,11,19,12],[20,2,20,10],[20,18,20,19],[21,2,21,10],[21,18,21,19],[15,2,15,10],[15,18,15,19],[16,2,16,10],[16,18,16,19],[17,1,17,10],[17,18,17,19],[12,2,12,10],[12,11,12,12],[13,2,13,10],[13,18,13,19],[14,2,14,10],[14,18,14,19],[5,0,5,20],[7,18,7,19],[8,1,8,2],[8,18,8,19],[10,2,10,10],[10,11,10,12],[10,18,10,19]]}
[]
["K O N I N K L I J K E   B E L G I S C H E    B I L J A R T B O N D ",null,null,null,null,null,null,null,null,null,null,null,"-","F E D E R A T I O N  R O Y A L E   B E L G E  DE  B I L L A R D "]
[null,null,null,null,"VZW - Zetel -  \" Café Sport \" - Martelarenplein, 13  -  3000 Leuven"]
[null,null,null,"GEWEST  BEIDE  VLAANDEREN"]
[null,null,null,null,null,null,null,null,null,null,"2018 - 2019"]
["UITSLAG GEWESTVOORRONDE   :  EXC  KLASSE   DRIEBANDEN  MB"]
[]
[null,"Inrichting : K.BC ONS HUIS ",null,null,null,null,null,null,null,null,null,null,null,null,null,null,"C","MIN","MAX"]
[null,"datum  : ",null,"za, 2 en zondag 3 februari 2019",null,null,null,null,null,null,null,null,null,null,42,null,null,0.76500000000000001,0.95]
[null,null,null,null,null,null,null,null,null,null,null,null,null,null,null,null,null,null,null,null,null,null,null,null,null,null,null,null,null,"  "]
[null,"NATID","NAAM ",null,null,null,null,null,null,null,null,"CLUB",null,"WEDP","BP","Beurten","GEM 2,30","HR","OPM",null,"Pl",null,null,null,"rooster4","rooster 5","rooster 6","rooster7"]
[]
[null,4361,{"$f":"VLOOKUP(B13,LEDEN!A:B,2,FALSE)","v":"MANGELINCKX Nico"},null,null,null,null,null,null,null,null,{"$f":"VLOOKUP(B13,LEDEN!A:C,3,FALSE)","v":"KOH"},null,null,null,null,null,null,null,null,null,null,null,null,null,null,null,null," "]
[null,null,{"$f":"VLOOKUP(B14,LEDEN!A:B,2,FALSE)","v":{"$error":"#N/A"}},null,null,null,null,null,null,null,null,null,null,null,null,null,{"$f":"IF(P14=0,\" \",TRUNC(O14/P14,2))","v":" "},null,{"$f":"IF(O14=0,\"\",IF(Q14>=X14,\"PR\",IF(Q14<W14,\"OG\",\"MG\")))","v":""},null,null,null,0.76500000000000001,0.94899999999999995,"a1","a1","a1","a1",null,"  "]
[null,null,{"$f":"VLOOKUP(B15,LEDEN!A:B,2,FALSE)","v":{"$error":"#N/A"}},null,null,null,null,null,null,null,null,null,null,null,null,null,{"$f":"IF(P15=0,\" \",TRUNC(O15/P15,2))","v":" "},null,{"$f":"IF(O15=0,\"\",IF(Q15>=X15,\"PR\",IF(Q15<W15,\"OG\",\"MG\")))","v":""},null,null,null,0.76500000000000001,0.94899999999999995,"a2","a2","a6","a4"]
[null,null,{"$f":"VLOOKUP(B16,LEDEN!A:B,2,FALSE)","v":{"$error":"#N/A"}},null,null,null,null,null,null,null,null,null,null,null,null,null," ",null,"",null,null,null,0.76500000000000001,0.94899999999999995,null,"a5","a3","a7",null,null,null," "]
[null,null,{"$f":"VLOOKUP(B17,LEDEN!A:B,2,FALSE)","v":{"$error":"#N/A"}},null,null,null,null,null,null,null,null,null,null,null,null,null," ",null,"",null,null,null,0.76500000000000001,0.94899999999999995,null,"a3","a4","a5"]
[null,"EINDRESULTAAT",null,null,null,null,null,null,null,null,null,null,null,{"$f":"SUM(N14:N17)","v":0},{"$f":"SUM(O14:O17)","v":0},{"$f":"SUM(P14:P17)","v":0},{"$f":"IF(P18=0,\" \",TRUNC(O18/P18,2))","v":" "},{"$f":"MAX(R14:R17)","v":0},{"$f":"IF(O18=0,\"\",IF(Q18>=X18,\"PR\",IF(Q18<W18,\"OG\",\"MG\")))","v":""},null,null,null,0.76500000000000001,0.94899999999999995,null,"a4","a5","a6"]
[]
[null,4363,{"$f":"VLOOKUP(B20,LEDEN!A:B,2,FALSE)","v":"PRIEUS Andy"},null,null,null,null,null,null,null,null,{"$f":"VLOOKUP(B20,LEDEN!A:C,3,FALSE)","v":"K.BR"},null,null,null,null,null,null,null,null,null,null,null,null,"a2","a2","a2","a2"]
[null,4557,{"$f":"VLOOKUP(B21,LEDEN!A:B,2,FALSE)","v":"SERWEYTENS Lieven"},null,null,null,null,null,null,null,null,null,null,null,null,null,{"$f":"IF(P21=0,\" \",TRUNC(O21/P21,2))","v":" "},null,{"$f":"IF(O21=0,\"\",IF(Q21>=X21,\"PR\",IF(Q21<W21,\"OG\",\"MG\")))","v":""},null,null,null,0.76500000000000001,0.94899999999999995,"a1","a1","a6","a5"]
[null,null,{"$f":"VLOOKUP(B22,LEDEN!A:B,2,FALSE)","v":{"$error":"#N/A"}},null,null,null,null,null,null,null,null,null,null,null,null,null,{"$f":"IF(P22=0,\" \",TRUNC(O22/P22,2))","v":" "},null,{"$f":"IF(O22=0,\"\",IF(Q22>=X22,\"PR\",IF(Q22<W22,\"OG\",\"MG\")))","v":""},null,null,null,0.76500000000000001,0.94899999999999995,null,"a4","a4","a7"]
[null,null,{"$f":"VLOOKUP(B23,LEDEN!A:B,2,FALSE)","v":{"$error":"#N/A"}},null,null,null,null,null,null,null,null,null,null,null,null,null," ",null,"",null,null,null,0.76500000000000001,0.94899999999999995,null,"a5","a5","a4"]
[null,null,{"$f":"VLOOKUP(B24,LEDEN!A:B,2,FALSE)","v":{"$error":"#N/A"}},null,null,null,null,null,null,null,null,null,null,null,null,null," ",null,"",null,null,null,0.76500000000000001,0.94899999999999995,null,"a3","a3","a6"]
[null,"EINDRESULTAAT",null,null,null,null,null,null,null,null,null,null,null,{"$f":"SUM(N21:N24)","v":0},{"$f":"SUM(O21:O24)","v":0},{"$f":"SUM(P21:P24)","v":0},{"$f":"IF(P25=0,\" \",TRUNC(O25/P25,2))","v":" "},{"$f":"MAX(R21:R24)","v":0},{"$f":"IF(O25=0,\"\",IF(Q25>=X25,\"PR\",IF(Q25<W25,\"OG\",\"MG\")))","v":""},null,null,null,0.76500000000000001,0.94899999999999995]
[]
[null,4557,{"$f":"VLOOKUP(B27,LEDEN!A:B,2,FALSE)","v":"SERWEYTENS Lieven"},null,null,null,null,null,null,null,null,{"$f":"VLOOKUP(B27,LEDEN!A:C,3,FALSE)","v":"K.BR"},null,null,null,null,null,null,null,null,null,null,null,null,"a3","a3","a3","a3"]
[null,4363,{"$f":"VLOOKUP(B28,LEDEN!A:B,2,FALSE)","v":"PRIEUS Andy"},null,null,null,null,null,null,null,null,null,null,null,null,null,{"$f":"IF(P28=0,\" \",TRUNC(O28/P28,2))","v":" "},null,{"$f":"IF(O28=0,\"\",IF(Q28>=X28,\"PR\",IF(Q28<W28,\"OG\",\"MG\")))","v":""},null,null,null,0.76500000000000001,0.94899999999999995,"a4","a4","a5","a4"]
[null,null,{"$f":"VLOOKUP(B29,LEDEN!A:B,2,FALSE)","v":{"$error":"#N/A"}},null,null,null,null,null,null,null,null,null,null,null,null,null,{"$f":"IF(P29=0,\" \",TRUNC(O29/P29,2))","v":" "},null,{"$f":"IF(O29=0,\"\",IF(Q29>=X29,\"PR\",IF(Q29<W29,\"OG\",\"MG\")))","v":""},null,null,null,0.76500000000000001,0.94899999999999995,null,"a5","a1","a6"]
[null,null,{"$f":"VLOOKUP(B30,LEDEN!A:B,2,FALSE)","v":{"$error":"#N/A"}},null,null,null,null,null,null,null,null,null,null,null,null,null," ",null,"",null,null,null,0.76500000000000001,0.94899999999999995,null,"a1","a6","a7"]
[null,null,{"$f":"VLOOKUP(B31,LEDEN!A:B,2,FALSE)","v":{"$error":"#N/A"}},null,null,null,null,null,null,null,null,null,null,null,null,null," ",null,"",null,null,null,0.76500000000000001,0.94899999999999995,null,"a2","a2","a5"]
[null,"EINDRESULTAAT",null,null,null,null,null,null,null,null,null,null,null,{"$f":"SUM(N28:N31)","v":0},{"$f":"SUM(O28:O31)","v":0},{"$f":"SUM(P28:P31)","v":0},{"$f":"IF(P32=0,\" \",TRUNC(O32/P32,2))","v":" "},{"$f":"MAX(R28:R31)","v":0},{"$f":"IF(O32=0,\"\",IF(Q32>=X32,\"PR\",IF(Q32<W32,\"OG\",\"MG\")))","v":""},null,null,null,0.76500000000000001,0.94899999999999995]
[]
[null,1329,{"$f":"VLOOKUP(B34,LEDEN!A:B,2,FALSE)","v":"COENEN Philip"},null,null,null,null,null,null,null,null,{"$f":"VLOOKUP(B34,LEDEN!A:C,3,FALSE)","v":"KKBC"},null,null,null,null,null,null,null,null,null,null,null,null,"a4","a4","a4","a4"]
[null,4931,{"$f":"VLOOKUP(B35,LEDEN!A:B,2,FALSE)","v":"VAN HOYLANDT ROGER"},null,null,null,null,null,null,null,null,null,null,null,null,null,{"$f":"IF(P35=0,\" \",TRUNC(O35/P35,2))","v":" "},null,{"$f":"IF(O35=0,\"\",IF(Q35>=X35,\"PR\",IF(Q35<W35,\"OG\",\"MG\")))","v":""},null,null,null,0.76500000000000001,0.94899999999999995,"a3","a3","a5","a1"]
[null,null,{"$f":"VLOOKUP(B36,LEDEN!A:B,2,FALSE)","v":{"$error":"#N/A"}},null,null,null,null,null,null,null,null,null,null,null,null,null,{"$f":"IF(P36=0,\" \",TRUNC(O36/P36,2))","v":" "},null,{"$f":"IF(O36=0,\"\",IF(Q36>=X36,\"PR\",IF(Q36<W36,\"OG\",\"MG\")))","v":""},null,null,null,0.76500000000000001,0.94899999999999995,null,"a2","a2","a3"]
[null,null,{"$f":"VLOOKUP(B37,LEDEN!A:B,2,FALSE)","v":{"$error":"#N/A"}},null,null,null,null,null,null,null,null,null,null,null,null,null," ",null,"",null,null,null,0.76500000000000001,0.94899999999999995,null,"a5","a1","a2"]
[null,null,{"$f":"VLOOKUP(B38,LEDEN!A:B,2,FALSE)","v":{"$error":"#N/A"}},null,null,null,null,null,null,null,null,null,null,null,null,null," ",null,"",null,null,null,0.76500000000000001,0.94899999999999995,null,"a1","a6","a6",null," "]
[null,"EINDRESULTAAT",null,null,null,null,null,null,null,null,null,null,null,{"$f":"SUM(N35:N38)","v":0},{"$f":"SUM(O35:O38)","v":0},{"$f":"SUM(P35:P38)","v":0},{"$f":"IF(P39=0,\" \",TRUNC(O39/P39,2))","v":" "},{"$f":"MAX(R35:R38)","v":0},{"$f":"IF(O39=0,\"\",IF(Q39>=X39,\"PR\",IF(Q39<W39,\"OG\",\"MG\")))","v":""}]
[]
[null,4931,{"$f":"VLOOKUP(B41,LEDEN!A:B,2,FALSE)","v":"VAN HOYLANDT ROGER"},null,null,null,null,null,null,null,null,{"$f":"VLOOKUP(B41,LEDEN!A:C,3,FALSE)","v":"QU"}]
[null,1329,{"$f":"VLOOKUP(B42,LEDEN!A:B,2,FALSE)","v":"COENEN Philip"},null,null,null,null,null,null,null,null,null,null,null,null,null,{"$f":"IF(P42=0,\" \",TRUNC(O42/P42,2))","v":" "},null,{"$f":"IF(O42=0,\"\",IF(Q42>=X42,\"PR\",IF(Q42<W42,\"OG\",\"MG\")))","v":""}]
[null,null,{"$f":"VLOOKUP(B43,LEDEN!A:B,2,FALSE)","v":{"$error":"#N/A"}},null,null,null,null,null,null,null,null,null,null,null,null,null,{"$f":"IF(P43=0,\" \",TRUNC(O43/P43,2))","v":" "},null,{"$f":"IF(O43=0,\"\",IF(Q43>=X43,\"PR\",IF(Q43<W43,\"OG\",\"MG\")))","v":""}]
[null,null,{"$f":"VLOOKUP(B44,LEDEN!A:B,2,FALSE)","v":{"$error":"#N/A"}},null,null,null,null,null,null,null,null,null,null,null,null,null," ",null,""]
[null,null,{"$f":"VLOOKUP(B45,LEDEN!A:B,2,FALSE)","v":{"$error":"#N/A"}},null,null,null,null,null,null,null,null,null,null,null,null,null," ",null,""]
[null,"EINDRESULTAAT",null,null,null,null,null,null,null,null,null,null,null,{"$f":"SUM(N42:N45)","v":0},{"$f":"SUM(O42:O45)","v":0},{"$f":"SUM(P42:P45)","v":0},{"$f":"IF(P46=0,\" \",TRUNC(O46/P46,2))","v":" "},{"$f":"MAX(R42:R45)","v":0},{"$f":"IF(O46=0,\"\",IF(Q46>=X46,\"PR\",IF(Q46<W46,\"OG\",\"MG\")))","v":""}]
[]
[]
[null,null,null,"2019-02-03",null,null,null,null,null,null,null,null,null,null,null,"Albert Verbeken"]

{"sheet":"EXC zf","index":1,"n_rows":49,"n_cols":32,"rows_kept":49,"cut":false,"hidden":false,"merged":[[48,3,48,9],[48,15,48,20],[43,2,43,10],[43,18,43,19],[44,2,44,10],[44,18,44,19],[45,1,45,10],[45,18,45,19],[40,2,40,10],[40,11,40,12],[41,2,41,10],[41,18,41,19],[42,2,42,10],[42,18,42,19],[36,2,36,10],[36,18,36,19],[37,2,37,10],[37,18,37,19],[38,1,38,10],[38,18,38,19],[33,2,33,10],[33,11,33,12],[34,2,34,10],[34,18,34,19],[35,2,35,10],[35,18,35,19],[29,2,29,10],[29,18,29,19],[30,2,30,10],[30,18,30,19],[31,1,31,10],[31,18,31,19],[26,2,26,10],[26,11,26,12],[27,2,27,10],[27,18,27,19],[28,2,28,10],[28,18,28,19],[22,2,22,10],[22,18,22,19],[23,2,23,10],[23,18,23,19],[24,1,24,10],[24,18,24,19],[19,2,19,10],[19,11,19,12],[20,2,20,10],[20,18,20,19],[21,2,21,10],[21,18,21,19],[15,2,15,10],[15,18,15,19],[16,2,16,10],[16,18,16,19],[17,1,17,10],[17,18,17,19],[12,2,12,10],[12,11,12,12],[13,2,13,10],[13,18,13,19],[14,2,14,10],[14,18,14,19],[5,0,5,20],[7,18,7,19],[8,1,8,2],[8,18,8,19],[10,2,10,10],[10,11,10,12],[10,18,10,19]]}
[]
["K O N I N K L I J K E   B E L G I S C H E    B I L J A R T B O N D ",null,null,null,null,null,null,null,null,null,null,null,"-","F E D E R A T I O N  R O Y A L E   B E L G E  DE  B I L L A R D "]
[null,null,null,null,"VZW - Zetel -  \" Café Sport \" - Martelarenplein, 13  -  3000 Leuven"]
[null,null,null,"GEWEST  BEIDE  VLAANDEREN"]
[null,null,null,null,null,null,null,null,null,null,"2018 - 2019"]
["UITSLAG GEWESTVOORRONDE   :  EXC  KLASSE   DRIEBANDEN  MB"]
[]
[null,"Inrichting : K.BC ONS HUIS ",null,null,null,null,null,null,null,null,null,null,null,null,null,null,"C","MIN","MAX"]
[null,"datum  : ",null,"za, 2 en zondag 3 februari 2019",null,null,null,null,null,null,null,null,null,null,42,null,null,0.76500000000000001,0.94899999999999995]
[null,null,null,null,null,null,null,null,null,null,null,null,null,null,null,null,null,null,null,null,null,null,null,null,null,null,null,null,null,"  "]
[null,"NATID","NAAM ",null,null,null,null,null,null,null,null,"CLUB",null,"WEDP","BP","Beurten","GEM 2,30","HR","OPM",null,"Pl",null,null,null,"rooster4","rooster 5","rooster 6","rooster7"]
[]
[null,4361,{"$f":"VLOOKUP(B13,LEDEN!A:B,2,FALSE)","v":"MANGELINCKX Nico"},null,null,null,null,null,null,null,null,{"$f":"VLOOKUP(B13,LEDEN!A:C,3,FALSE)","v":"KOH"},null,null,null,null,null,null,null,null,null,null,null,null,null,null,null,null," "]
[null,4931,{"$f":"VLOOKUP(B14,LEDEN!A:B,2,FALSE)","v":"VAN HOYLANDT ROGER"},null,null,null,null,null,null,null,null,null,null,0,35,45,{"$f":"IF(P14=0,\" \",TRUNC(O14/P14,3))","v":0.77700000000000002},4,{"$f":"IF(O14=0,\"\",IF(Q14>X14,\"PR\",IF(Q14<W14,\"OG\",\"MG\")))","v":"MG"},null,null,null,0.76500000000000001,0.94899999999999995,"a1","a1","a1","a1",null,"  "]
[null,4363,{"$f":"VLOOKUP(B15,LEDEN!A:B,2,FALSE)","v":"PRIEUS Andy"},null,null,null,null,null,null,null,null,null,null,0,36,56,{"$f":"IF(P15=0,\" \",TRUNC(O15/P15,3))","v":0.64200000000000002},8,{"$f":"IF(O15=0,\"\",IF(Q15>X15,\"PR\",IF(Q15<W15,\"OG\",\"MG\")))","v":"OG"},null,null,null,0.76500000000000001,0.94899999999999995,"a2","a2","a6","a4"]
[null,1329,{"$f":"VLOOKUP(B16,LEDEN!A:B,2,FALSE)","v":"COENEN Philip"},null,null,null,null,null,null,null,null,null,null,0,27,36,{"$f":"IF(P16=0,\" \",TRUNC(O16/P16,3))","v":0.75},4,"OG",null,null,null,0.76500000000000001,0.94899999999999995,null,"a5","a3","a7",null,null,null," "]
[null,4557,{"$f":"VLOOKUP(B17,LEDEN!A:B,2,FALSE)","v":"SERWEYTENS Lieven"},null,null,null,null,null,null,null,null,null,null,2,42,74,{"$f":"IF(P17=0,\" \",TRUNC(O17/P17,3))","v":0.56699999999999995},3,"OG",null,null,null,0.76500000000000001,0.94899999999999995,null,"a3","a4","a5"]
[null,"EINDRESULTAAT",null,null,null,null,null,null,null,null,null,null,null,{"$f":"SUM(N14:N17)","v":2},{"$f":"SUM(O14:O17)","v":140},211,{"$f":"O18/P18","v":0.6635071090047393},8,"OG",null,3,null,0.76500000000000001,0.94899999999999995,null,"a4","a5","a6"]
[]
[null,4363,{"$f":"VLOOKUP(B20,LEDEN!A:B,2,FALSE)","v":"PRIEUS Andy"},null,null,null,null,null,null,null,null,{"$f":"VLOOKUP(B20,LEDEN!A:C,3,FALSE)","v":"K.BR"},null,null,null,null,null,null,null,null,null,null,null,null,"a2","a2","a2","a2"]
[null,4557,{"$f":"VLOOKUP(B21,LEDEN!A:B,2,FALSE)","v":"SERWEYTENS Lieven"},null,null,null,null,null,null,null,null,null,null,2,42,63,{"$f":"IF(P21=0,\" \",TRUNC(O21/P21,3))","v":0.66600000000000004},5,{"$f":"IF(O21=0,\"\",IF(Q21>X21,\"PR\",IF(Q21<W21,\"OG\",\"MG\")))","v":"OG"},null,null,null,0.76500000000000001,0.94899999999999995,"a1","a1","a6","a5"]
[null,4361,{"$f":"VLOOKUP(B22,LEDEN!A:B,2,FALSE)","v":"MANGELINCKX Nico"},null,null,null,null,null,null,null,null,null,null,2,42,56,0.75,6,"OG",null,null,null,0.76500000000000001,0.94899999999999995,null,"a4","a4","a7"]
[null,4931,{"$f":"VLOOKUP(B23,LEDEN!A:B,2,FALSE)","v":"VAN HOYLANDT ROGER"},null,null,null,null,null,null,null,null,null,null,2,42,62,0.67700000000000005,3,"OG",null,null,null,0.76500000000000001,0.94899999999999995,null,"a5","a5","a4"]
[null,1329,{"$f":"VLOOKUP(B24,LEDEN!A:B,2,FALSE)","v":"COENEN Philip"},null,null,null,null,null,null,null,null,null,null,0,38,50,0.76,6,"OG",null,null,null,0.76500000000000001,0.94899999999999995,null,"a3","a3","a6"]
[null,"EINDRESULTAAT",null,null,null,null,null,null,null,null,null,null,null,{"$f":"SUM(N21:N24)","v":6},{"$f":"SUM(O21:O24)","v":164},{"$f":"SUM(P21:P24)","v":231},{"$f":"O25/P25","v":0.70995670995671001},6,"OG",null,2,null,0.76500000000000001,0.94899999999999995]
[]
[null,4557,{"$f":"VLOOKUP(B27,LEDEN!A:B,2,FALSE)","v":"SERWEYTENS Lieven"},null,null,null,null,null,null,null,null,{"$f":"VLOOKUP(B27,LEDEN!A:C,3,FALSE)","v":"K.BR"},null,null,null,null,null,null,null,null,null,null,null,null,"a3","a3","a3","a3"]
[null,4363,{"$f":"VLOOKUP(B28,LEDEN!A:B,2,FALSE)","v":"PRIEUS Andy"},null,null,null,null,null,null,null,null,null,null,0,41,63,{"$f":"IF(P28=0,\" \",TRUNC(O28/P28,3))","v":0.65},4,{"$f":"IF(O28=0,\"\",IF(Q28>X28,\"PR\",IF(Q28<W28,\"OG\",\"MG\")))","v":"OG"},null,null,null,0.76500000000000001,0.94899999999999995,"a4","a4","a5","a4"]
[null,1329,{"$f":"VLOOKUP(B29,LEDEN!A:B,2,FALSE)","v":"COENEN Philip"},null,null,null,null,null,null,null,null,null,null,0,31,51,0.60699999999999998,6,"OG",null,null,null,0.76500000000000001,0.94899999999999995,null,"a5","a1","a6"]
[null,4931,{"$f":"VLOOKUP(B30,LEDEN!A:B,2,FALSE)","v":"VAN HOYLANDT ROGER"},null,null,null,null,null,null,null,null,null,null,2,42,55,0.76300000000000001,4,"OG",null,null,null,0.76500000000000001,0.94899999999999995,null,"a1","a6","a7"]
[null,4361,{"$f":"VLOOKUP(B31,LEDEN!A:B,2,FALSE)","v":"MANGELINCKX Nico"},null,null,null,null,null,null,null,null,null,null,0,38,74,0.51300000000000001,6,"OG",null,null,null,0.76500000000000001,0.94899999999999995,null,"a2","a2","a5"]
[null,"EINDRESULTAAT",null,null,null,null,null,null,null,null,null,null,null,{"$f":"SUM(N28:N31)","v":2},{"$f":"SUM(O28:O31)","v":152},{"$f":"SUM(P28:P31)","v":243},{"$f":"O32/P32","v":0.62551440329218111},6,"OG",null,4,null,0.76500000000000001,0.94899999999999995]
[]
[null,1329,{"$f":"VLOOKUP(B34,LEDEN!A:B,2,FALSE)","v":"COENEN Philip"},null,null,null,null,null,null,null,null,{"$f":"VLOOKUP(B34,LEDEN!A:C,3,FALSE)","v":"KKBC"},null,null,null,null,null,null,null,null,null,null,null,null,"a4","a4","a4","a4"]
[null,4931,{"$f":"VLOOKUP(B35,LEDEN!A:B,2,FALSE)","v":"VAN HOYLANDT ROGER"},null,null,null,null,null,null,null,null,null,null,2,42,68,{"$f":"IF(P35=0,\" \",TRUNC(O35/P35,3))","v":0.61699999999999999},4,{"$f":"IF(O35=0,\"\",IF(Q35>X35,\"PR\",IF(Q35<W35,\"OG\",\"MG\")))","v":"OG"},null,null,null,0.76500000000000001,0.94899999999999995,"a3","a3","a5","a1"]
[null,4557,{"$f":"VLOOKUP(B36,LEDEN!A:B,2,FALSE)","v":"SERWEYTENS Lieven"},null,null,null,null,null,null,null,null,null,null,2,42,51,0.82299999999999995,6,"MG",null,null,null,0.76500000000000001,0.94899999999999995,null,"a2","a2","a3"]
[null,4361,{"$f":"VLOOKUP(B37,LEDEN!A:B,2,FALSE)","v":"MANGELINCKX Nico"},null,null,null,null,null,null,null,null,null,null,2,42,36,1.1659999999999999,7,"PR",null,null,null,0.76500000000000001,0.94899999999999995,null,"a5","a1","a2"]
[null,4363,{"$f":"VLOOKUP(B38,LEDEN!A:B,2,FALSE)","v":"PRIEUS Andy"},null,null,null,null,null,null,null,null,null,null,2,42,50,0.84,6,"MG",null,null,null,0.76500000000000001,0.94899999999999995,null,"a1","a6","a6",null," "]
[null,"EINDRESULTAAT",null,null,null,null,null,null,null,null,null,null,null,{"$f":"SUM(N35:N38)","v":8},{"$f":"SUM(O35:O38)","v":168},{"$f":"SUM(P35:P38)","v":205},{"$f":"O39/P39","v":0.81951219512195117},7,"MG",null,1,null,0.76500000000000001,0.94899999999999995]
[]
[null,4931,{"$f":"VLOOKUP(B41,LEDEN!A:B,2,FALSE)","v":"VAN HOYLANDT ROGER"},null,null,null,null,null,null,null,null,{"$f":"VLOOKUP(B41,LEDEN!A:C,3,FALSE)","v":"QU"}]
[null,1329,{"$f":"VLOOKUP(B42,LEDEN!A:B,2,FALSE)","v":"COENEN Philip"},null,null,null,null,null,null,null,null,null,null,0,31,68,{"$f":"IF(P42=0,\" \",TRUNC(O42/P42,3))","v":0.45500000000000002},3,{"$f":"IF(O42=0,\"\",IF(Q42>X42,\"PR\",IF(Q42<W42,\"OG\",\"MG\")))","v":"OG"},null,null,null,0.76500000000000001,0.94899999999999995]
[null,4361,{"$f":"VLOOKUP(B43,LEDEN!A:B,2,FALSE)","v":"MANGELINCKX Nico"},null,null,null,null,null,null,null,null,null,null,2,42,45,0.93300000000000005,8,{"$f":"IF(O43=0,\"\",IF(Q43>X43,\"PR\",IF(Q43<W43,\"OG\",\"MG\")))","v":"MG"},null,null,null,0.76500000000000001,0.94899999999999995]
[null,4557,{"$f":"VLOOKUP(B44,LEDEN!A:B,2,FALSE)","v":"SERWEYTENS Lieven"},null,null,null,null,null,null,null,null,null,null,0,27,55,0.49,3,"OG",null,null,null,0.76500000000000001,0.94899999999999995]
[null,4363,{"$f":"VLOOKUP(B45,LEDEN!A:B,2,FALSE)","v":"PRIEUS Andy"},null,null,null,null,null,null,null,null,null,null,0,35,62,0.56399999999999995,3,"OG",null,null,null,0.76500000000000001,0.94899999999999995]
[null,"EINDRESULTAAT",null,null,null,null,null,null,null,null,null,null,null,{"$f":"SUM(N42:N45)","v":2},{"$f":"SUM(O42:O45)","v":135},{"$f":"SUM(P42:P45)","v":230},{"$f":"O46/P46","v":0.58695652173913049},8,"OG",null,5,null,0.76500000000000001,0.94899999999999995]
[]
[]
[null,null,null,"2019-02-03",null,null,null,null,null,null,null,null,null,null,null,"Albert Verbeken"]

{"sheet":"LEDEN","index":2,"n_rows":803,"n_cols":6,"rows_kept":803,"cut":false,"hidden":false,"merged":[]}
[null,null,null,"NS"]
[]
[8758,"DUYM Ignace","ACG"]
[4505,"BRACKE Peter","ACG"]
[2314,"SONCK ROBBY","ACG"]
[6927,"DUJARDIN Luc","ACG"]
[4432,"BAETE Jean-Pierre","ACG"]
[9431,"JACQUEMYN Tony","KBCAW"]
[4496,"VAN HANEGEM Izaak","ACG"]
[6705,"BERNAERDT Roland","ACG"]
[4496,"VAN HANEGEM Izaak","ACG"]
[7125,"Nuytten Renold","ACG"]
[9821,"VAN DEN BOSSCHE Daniël","UN"]
[7302,"DE CRAECKER Werner","ACG"]
[9800,"DE CRAECKER Emma (jeugd)","ACG"]
[9826,"DE BIE Rudy","ACG"]
[4416,"VAN RIJSSELBERGHE Johan","ACG"]
[9261,"de MEULEMEESTER Cédric","ACG"]
[1036,"DEPOORTER MIEKE","ACG"]
[4845,"STEVENS PATRICK","KBCAW"]
[5587,"GERMONPRE Luc","ACG"]
[8671,"DE MUYNCK Jean-Pierre","ACG"]
[8672,"DEMOOR Danny","ACG"]
[6428,"MEULEMAN Rudy","ACG"]
[]
[null," "]
[4854,"ROSIER Peter","BCSK"]
[4895,"DE BLOCK Omer","BCSK"]
[6488,"DE WITTE Franky","BCSK"]
[6489,"DE WITTE Jeffrey","BCSK"]
[7812,"BOERJAN Pierre","BCSK"]
[8674,"VAN LEUVENHAGE Dylan","BCSK"]
[8900,"JANSSENS Dirk","BCSK"]
[1294,"BACKMAN Werner","BCSK"]
[8133,"VAN CRAENENBROECK Theo","BCSK"]
[4853,"NOPPE Robert","BCSK",null,null," "]
["6784B","VAN BIESEN Tom","BCSK"]
[9441,"ROSIER Nick","BCSK"]
[9442,"VERGULT François","BCSK"]
[4937,"LEEMANS Willy","KGV"]
[9276,"DE KORT Marc","BCSK"]
[4894,"DAELMAN Walther","BCSK"]
[8507,"TROONBEECKX Willy","BCSK"]
[8717,"VAN DEN EEDEN Kurt","K.SNBA"]
[8073,"DE WITTE Tamara","BCSK"]
[8385,"GODDAERT Johan","BCSK"]
[9955,"DE RUDDER David","BCSK"]
[9348,"WOUTERS Marc","BCSK"]
[8650,"DE BOEY Gijs","BCSK"]
[]
[8689,"DEWAELE Eddy","CBC-DLS"]
[8690,"JOYE Rik","CBC-DLS"]
[8704,"CALLENS Filip","CBC-DLS"]
[8691,"BRUNEEL Norbert ","CBC-DLS"]
[8649,"VAN DE VELDE Desire","CBC-DLS"]
[8658,"MONDELAERS Dries","CBC-DLS"]
[8652,"TANGHE Freddy","CBC-DLS"]
[]
[4192,"BEAUJEAN Karel","CM"]
[9059,"BERTEN Franky","CM"]
[5500,"ROELANTS Karel","CM"]
[4143,"VAN CRAEN Albert","CM"]
[6189,"VANDENABEELE Marc","CM"]
[7796,"DE LAET Cassy","CM"]
[7822,"SCHOUTETENS Marc","CM"]
[9512,"DE SCHILDER Leon","CM"]
[9513,"CARPAY Henri","CM"]
[4682,"SCHOUTETENS Pieter","CM"]
[]
[7465,"COUSSEMENT Wim","DK"]
[9413,"DANNEELS Laurent","DK"]
[5682,"DELANGHE Lievin","DK"]
[4188,"RONDELEZ Noel","DK"]
[4180,"CONSTANT Geert","DK"]
[8047,"DEVRIENDT Bart","DK"]
[]
[4763,"CASTELEYN Rik","DOS"]
[1061,"GELDHOF Frank","DOS"]
[4762,"CASTELEYN Henk","DOS"]
[4765,"DEBAES Peter","DOS"]
[4768,"DEDIER Georges","DOS"]
[8156,"DETOLLENAERE Jonny","DOS"]
[4776,"HOUTHAEVE Jean-Marie","DOS"]
[4778,"LEYN Philippe","DOS"]
[7697,"GHESQUIERE Jozef","DOS"]
[8090,"VANLAUWE Stephan","DOS"]
[4693,"MOSTREY Peter","DOS"]
[4733,"NUYTTENS Gino","DOS"]
[6720,"WILLE Etienne","DOS"]
[4738,"VANDENDRIESSCHE Philip","KKBC"]
[6094,"VANACKER Steven","DOS"]
[9461,"RONDELEZ Kenneth","DOS"]
[2299,"VANTHOURNOUT Michel","DOS"]
[1055,"BRUWIER Erwin","DOS"]
[8705,"STEVENS Ilse","DOS"]
[4774,"DUYCK Peter","DOS"]
[8697,"MELNYTSCHENKO Cédric","DOS"]
[4759,"WARLOP Luc","DOS"]
[1060,"Wittevrongel Dirk","DOS"]
[9018,"GHEVART Jean","DOS"]
[9957,"BRUWIER Ludwin","DOS"]
[9958,"DEBLAUWE Dimitri","DOS"]
[9766,"VANNESTE Philip","DOS"]
[9045,"WALLART Jean-Charles","DOS"]
[]
[4454,"DEPOORTER Reginald","GS"]
[4466,"TREMERIE Walter","GS"]
[4541,"DELLAERT Marc","GS"]
[4587,"VERSTRAETEN Frank","GS"]
[6701,"BROCHE Philippe","GS"]
[6703,"CLAUS Pascal","GS"]
[7203,"DELARUE Dirk","GS"]
[7498,"VAN DAM Jens","GS"]
[8163,"DE WEIRDT Jean-Marie","GS"]
[8654,"BAETSLE Peter","GS"]
[8890,"VAN HOLLE Jean-Pierre","GS"]
[4506,"BRACKE Tom","GS"]
[9419,"MOEYKENS Biacio","GS"]
[9959,"DE DEYNE Firmin","GS"]
[8655,"TOLLEBEKE Arthur","GS"," "]
{"$rows_left_out":683}