{"text_format":"1","workbook":"xlsx","n_sheets":3,"sheets":["4°","4° zf","LEDEN"],"not_rendered":{"charts":0,"images":0,"macros":1,"external_links":2,"defined_names":6,"comments":0,"pivot_tables":0},"unopened":[],"bounds":{"document_bytes":16777216,"sheet_cells":100000,"rows_first":2000,"rows_last":500,"rows_between":2000,"halvings":0,"cell_chars":16384,"cell_head_chars":4096},"cells_cut":0,"cells_raw":0,"read":"whole","date_system":"1900"}

{"sheet":"4°","index":0,"n_rows":44,"n_cols":30,"rows_kept":44,"cut":false,"hidden":false,"merged":[[42,2,42,7],[36,2,36,10],[36,18,36,19],[37,2,37,10],[37,18,37,19],[38,1,38,10],[38,18,38,19],[33,2,33,10],[33,11,33,12],[34,2,34,10],[34,18,34,19],[35,2,35,10],[35,18,35,19],[29,2,29,10],[29,18,29,19],[30,2,30,10],[30,18,30,19],[31,1,31,10],[31,18,31,19],[26,2,26,10],[26,11,26,12],[27,2,27,10],[27,18,27,19],[28,2,28,10],[28,18,28,19],[22,2,22,10],[22,18,22,19],[23,2,23,10],[23,18,23,19],[24,1,24,10],[24,18,24,19],[19,2,19,10],[19,11,19,12],[20,2,20,10],[20,18,20,19],[21,2,21,10],[21,18,21,19],[15,2,15,10],[15,18,15,19],[16,2,16,10],[16,18,16,19],[17,1,17,10],[17,18,17,19],[12,2,12,10],[12,11,12,12],[13,2,13,10],[13,18,13,19],[14,2,14,10],[14,18,14,19],[5,0,5,20],[7,18,7,19],[8,1,8,2],[8,18,8,19],[10,2,10,10],[10,11,10,12],[10,18,10,19]]}
[]
["K O N I N K L I J K E   B E L G I S C H E    B I L J A R T B O N D ",null,null,null,null,null,null,null,null,null,null,null,"-","F E D E R A T I O N  R O Y A L E   B E L G E  DE  B I L L A R D "]
[null,null,null,null,"VZW - Zetel -  \" Café Sport \" - Martelarenplein, 13  -  3000 Leuven"]
[null,null,null,"GEWEST  BEIDE  VLAANDEREN"]
[null,null,null,null,null,null,null,null,null,null,"2017 - 2018"]
["UITSLAG GEWESTFINALE  :  4°  KLASSE   DRIEBANDEN  MB"]
[]
[null,"Inrichting : ",null,"KON. SINT-NIKLASE BA",null,null,null,null,null,null,null,null,null,null,null,null,null,"MIN","MAX"]
[null,"datum  : ",null,"zaterdag, 21 april 2018",null,null,null,null,null,null,null,null,null,null,18,null,null,0.33500000000000002,0.40500000000000003]
[null,null,null,null,null,null,null,null,null,null,null,null,null,null,null,null,null,null,null,null,null,null,null,null,null,null,null,null,null,"  "]
[null,"NATID","NAAM ",null,null,null,null,null,null,null,null,"CLUB",null,"WEDP","BP","Beurten","GEM 2,30","HR","OPM",null,"Pl",null,null,null,"rooster4","rooster 5","rooster 6","rooster7"]
[]
[null,7316,{"$f":"VLOOKUP(B13,LEDEN!A:B,2,FALSE)","v":"RONDELE Freddy"},null,null,null,null,null,null,null,null,{"$f":"VLOOKUP(B13,LEDEN!A:C,3,FALSE)","v":"WOH"},null,null,null,null,null,null,null,null,null,null,null,null,null,null,null,null," "]
[null,6399,{"$f":"VLOOKUP(B14,LEDEN!A:B,2,FALSE)","v":"DELAERE Marc"},null,null,null,null,null,null,null,null,null,null,2,18,39,{"$f":"IF(P14=0,\" \",TRUNC(O14/P14,3))","v":0.46100000000000002},3,{"$f":"IF(O14=0,\"\",IF(Q14>=X14,\"PR\",IF(Q14<W14,\"OG\",\"MG\")))","v":"PR"},null,null,null,0.33500000000000002,0.40400000000000003,"a1","a1","a1","a1",null,"  "]
[null,4922,{"$f":"VLOOKUP(B15,LEDEN!A:B,2,FALSE)","v":"LAUREYS Wilfried"},null,null,null,null,null,null,null,null,null,null,2,18,50,{"$f":"IF(P15=0,\" \",TRUNC(O15/P15,3))","v":0.36},3,{"$f":"IF(O15=0,\"\",IF(Q15>=X15,\"PR\",IF(Q15<W15,\"OG\",\"MG\")))","v":"MG"},null,null,null,0.33500000000000002,0.40400000000000003,"a2","a2","a6","a4"]
[null,1046,{"$f":"VLOOKUP(B16,LEDEN!A:B,2,FALSE)","v":"BRUGGEMAN Franky"},null,null,null,null,null,null,null,null,null,null,2,18,27,{"$f":"IF(P16=0,\" \",TRUNC(O16/P16,3))","v":0.66600000000000004},3,"PR",null,null,null,0.33500000000000002,0.40400000000000003,null,"a5","a3","a7"]
[null,null,{"$f":"VLOOKUP(B17,LEDEN!A:B,2,FALSE)","v":{"$error":"#N/A"}},null,null,null,null,null,null,null,null,null,null,null,null,null,{"$f":"IF(P17=0,\" \",TRUNC(O17/P17,2))","v":" "},null,"",null,null,null,0.33500000000000002,0.40400000000000003,null,"a3","a4","a5"]
[null,"EINDRESULTAAT",null,null,null,null,null,null,null,null,null,null,null,{"$f":"SUM(N14:N17)","v":6},{"$f":"SUM(O14:O17)","v":54},{"$f":"SUM(P14:P17)","v":116},{"$f":"IF(P18=0,\" \",TRUNC(O18/P18,3))","v":0.46500000000000002},3,{"$f":"IF(O18=0,\"\",IF(Q18>=X18,\"PR\",IF(Q18<W18,\"OG\",\"MG\")))","v":"PR"},null,1,null,0.33500000000000002,0.40400000000000003,null,"a4","a5","a6"]
[]
[null,1046,{"$f":"VLOOKUP(B20,LEDEN!A:B,2,FALSE)","v":"BRUGGEMAN Franky"},null,null,null,null,null,null,null,null,{"$f":"VLOOKUP(B20,LEDEN!A:C,3,FALSE)","v":"K.EBC"},null,null,null,null,null,null,null,null,null,null,null,null,"a2","a2","a2","a2"]
[null,4922,{"$f":"VLOOKUP(B21,LEDEN!A:B,2,FALSE)","v":"LAUREYS Wilfried"},null,null,null,null,null,null,null,null,null,null,2,18,41,{"$f":"IF(P21=0,\" \",TRUNC(O21/P21,3))","v":0.439},3,{"$f":"IF(O21=0,\"\",IF(Q21>=X21,\"PR\",IF(Q21<W21,\"OG\",\"MG\")))","v":"PR"},null,null,null,0.33500000000000002,0.40400000000000003,"a1","a1","a6","a5"]
[null,6399,{"$f":"VLOOKUP(B22,LEDEN!A:B,2,FALSE)","v":"DELAERE Marc"},null,null,null,null,null,null,null,null,null,null,2,18,42,{"$f":"IF(P22=0,\" \",TRUNC(O22/P22,3))","v":0.42799999999999999},3,{"$f":"IF(O22=0,\"\",IF(Q22>=X22,\"PR\",IF(Q22<W22,\"OG\",\"MG\")))","v":"PR"},null,null,null,0.33500000000000002,0.40400000000000003,null,"a4","a4","a7"]
[null,7316,{"$f":"VLOOKUP(B23,LEDEN!A:B,2,FALSE)","v":"RONDELE Freddy"},null,null,null,null,null,null,null,null,null,null,0,5,27,{"$f":"IF(P23=0,\" \",TRUNC(O23/P23,3))","v":0.185},2,"OG",null,null,null,0.33500000000000002,0.40400000000000003,null,"a5","a5","a4"]
[null,null,{"$f":"VLOOKUP(B24,LEDEN!A:B,2,FALSE)","v":{"$error":"#N/A"}},null,null,null,null,null,null,null,null,null,null,null,null,null,{"$f":"IF(P24=0,\" \",TRUNC(O24/P24,2))","v":" "},null,"",null,null,null,0.33500000000000002,0.40400000000000003,null,"a3","a3","a6"]
[null,"EINDRESULTAAT",null,null,null,null,null,null,null,null,null,null,null,{"$f":"SUM(N21:N24)","v":4},{"$f":"SUM(O21:O24)","v":41},{"$f":"SUM(P21:P24)","v":110},{"$f":"IF(P25=0,\" \",TRUNC(O25/P25,3))","v":0.372},{"$f":"MAX(R21:R24)","v":3},{"$f":"IF(O25=0,\"\",IF(Q25>=X25,\"PR\",IF(Q25<W25,\"OG\",\"MG\")))","v":"MG"},null,2,null,0.33500000000000002,0.40400000000000003]
[]
[null,4922,{"$f":"VLOOKUP(B27,LEDEN!A:B,2,FALSE)","v":"LAUREYS Wilfried"},null,null,null,null,null,null,null,null,{"$f":"VLOOKUP(B27,LEDEN!A:C,3,FALSE)","v":"KSNBA"},null,null,null,null,null,null,null,null,null,null,null,null,"a3","a3","a3","a3"]
[null,1046,{"$f":"VLOOKUP(B28,LEDEN!A:B,2,FALSE)","v":"BRUGGEMAN Franky"},null,null,null,null,null,null,null,null,null,null,0,4,41,{"$f":"IF(P28=0,\" \",TRUNC(O28/P28,3))","v":9.7000000000000003E-2},2,{"$f":"IF(O28=0,\"\",IF(Q28>=X28,\"PR\",IF(Q28<W28,\"OG\",\"MG\")))","v":"OG"},null,null,null,0.33500000000000002,0.40400000000000003,"a4","a4","a5","a4"]
[null,7316,{"$f":"VLOOKUP(B29,LEDEN!A:B,2,FALSE)","v":"RONDELE Freddy"},null,null,null,null,null,null,null,null,null,null,0,11,50,{"$f":"IF(P29=0,\" \",TRUNC(O29/P29,3))","v":0.22},2,{"$f":"IF(O29=0,\"\",IF(Q29>=X29,\"PR\",IF(Q29<W29,\"OG\",\"MG\")))","v":"OG"},null,null,null,0.33500000000000002,0.40400000000000003,null,"a5","a1","a6"]
[null,6399,{"$f":"VLOOKUP(B30,LEDEN!A:B,2,FALSE)","v":"DELAERE Marc"},null,null,null,null,null,null,null,null,null,null,0,10,34,{"$f":"IF(P30=0,\" \",TRUNC(O30/P30,3))","v":0.29399999999999998},2,"OG",null,null,null,0.33500000000000002,0.40400000000000003,null,"a1","a6","a7"]
[null,null,{"$f":"VLOOKUP(B31,LEDEN!A:B,2,FALSE)","v":{"$error":"#N/A"}},null,null,null,null,null,null,null,null,null,null,null,null,null,{"$f":"IF(P31=0,\" \",TRUNC(O31/P31,2))","v":" "},null,"",null,null,null,0.33500000000000002,0.40400000000000003,null,"a2","a2","a5"]
[null,"EINDRESULTAAT",null,null,null,null,null,null,null,null,null,null,null,{"$f":"SUM(N28:N31)","v":0},{"$f":"SUM(O28:O31)","v":25},{"$f":"SUM(P28:P31)","v":125},{"$f":"IF(P32=0,\" \",TRUNC(O32/P32,3))","v":0.2},{"$f":"MAX(R28:R31)","v":2},{"$f":"IF(O32=0,\"\",IF(Q32>=X32,\"PR\",IF(Q32<W32,\"OG\",\"MG\")))","v":"OG"},null,4,null,0.33500000000000002,0.40400000000000003]
[]
[null,6399,{"$f":"VLOOKUP(B34,LEDEN!A:B,2,FALSE)","v":"DELAERE Marc"},null,null,null,null,null,null,null,null,{"$f":"VLOOKUP(B34,LEDEN!A:C,3,FALSE)","v":"K.Br"},null,null,null,null,null,null,null,null,null,null,null,null,"a4","a4","a4","a4"]
[null,7316,{"$f":"VLOOKUP(B35,LEDEN!A:B,2,FALSE)","v":"RONDELE Freddy"},null,null,null,null,null,null,null,null,null,null,0,17,39,{"$f":"IF(P35=0,\" \",TRUNC(O35/P35,3))","v":0.435},2,{"$f":"IF(O35=0,\"\",IF(Q35>=X35,\"PR\",IF(Q35<W35,\"OG\",\"MG\")))","v":"PR"},null,null,null,0.33500000000000002,0.40400000000000003,"a3","a3","a5","a1"]
[null,1046,{"$f":"VLOOKUP(B36,LEDEN!A:B,2,FALSE)","v":"BRUGGEMAN Franky"},null,null,null,null,null,null,null,null,null,null,0,16,42,{"$f":"IF(P36=0,\" \",TRUNC(O36/P36,3))","v":0.38},4,{"$f":"IF(O36=0,\"\",IF(Q36>=X36,\"PR\",IF(Q36<W36,\"OG\",\"MG\")))","v":"MG"},null,null,null,0.33500000000000002,0.40400000000000003,null,"a2","a2","a3"]
[null,4922,{"$f":"VLOOKUP(B37,LEDEN!A:B,2,FALSE)","v":"LAUREYS Wilfried"},null,null,null,null,null,null,null,null,null,null,2,18,34,{"$f":"IF(P37=0,\" \",TRUNC(O37/P37,3))","v":0.52900000000000003},3,"PR",null,null,null,0.33500000000000002,0.40400000000000003,null,"a5","a1","a2"]
[null,null,{"$f":"VLOOKUP(B38,LEDEN!A:B,2,FALSE)","v":{"$error":"#N/A"}},null,null,null,null,null,null,null,null,null,null,null,null,null,{"$f":"IF(P38=0,\" \",TRUNC(O38/P38,2))","v":" "},null,"",null,null,null,0.33500000000000002,0.40400000000000003,null,"a1","a6","a6",null," "]
[null,"EINDRESULTAAT",null,null,null,null,null,null,null,null,null,null,null,{"$f":"SUM(N35:N38)","v":2},{"$f":"SUM(O35:O38)","v":51},{"$f":"SUM(P35:P38)","v":115},{"$f":"IF(P39=0,\" \",TRUNC(O39/P39,3))","v":0.443},{"$f":"MAX(R35:R38)","v":4},{"$f":"IF(O39=0,\"\",IF(Q39>=X39,\"PR\",IF(Q39<W39,\"OG\",\"MG\")))","v":"PR"},null,null,null,0.33500000000000002,0.40400000000000003]
[]
[]
[]
[null,null,{"$f":"TODAY()","v":"2018-04-23"},null,null,null,null,null,null,null,null,null,null,null,null,"Albert Verbeken"]
[null,null,null,null,null,null,null,null,null,null,null,null,null,null,null,"GSB Beide Vlaanderen"]

{"sheet":"4° zf","index":1,"n_rows":43,"n_cols":30,"rows_kept":43,"cut":false,"hidden":false,"merged":[[42,2,42,7],[36,2,36,10],[36,18,36,19],[37,2,37,10],[37,18,37,19],[38,1,38,10],[38,18,38,19],[33,2,33,10],[33,11,33,12],[34,2,34,10],[34,18,34,19],[35,2,35,10],[35,18,35,19],[29,2,29,10],[29,18,29,19],[30,2,30,10],[30,18,30,19],[31,1,31,10],[31,18,31,19],[26,2,26,10],[26,11,26,12],[27,2,27,10],[27,18,27,19],[28,2,28,10],[28,18,28,19],[22,2,22,10],[22,18,22,19],[23,2,23,10],[23,18,23,19],[24,1,24,10],[24,18,24,19],[19,2,19,10],[19,11,19,12],[20,2,20,10],[20,18,20,19],[21,2,21,10],[21,18,21,19],[15,2,15,10],[15,18,15,19],[16,2,16,10],[16,18,16,19],[17,1,17,10],[17,18,17,19],[12,2,12,10],[12,11,12,12],[13,2,13,10],[13,18,13,19],[14,2,14,10],[14,18,14,19],[5,0,5,20],[7,18,7,19],[8,1,8,2],[8,18,8,19],[10,2,10,10],[10,11,10,12],[10,18,10,19]]}
[]
["K O N I N K L I J K E   B E L G I S C H E    B I L J A R T B O N D ",null,null,null,null,null,null,null,null,null,null,null,"-","F E D E R A T I O N  R O Y A L E   B E L G E  DE  B I L L A R D "]
[null,null,null,null,"VZW - Zetel -  \" Café Sport \" - Martelarenplein, 13  -  3000 Leuven"]
[null,null,null,"GEWEST  BEIDE  VLAANDEREN"]
[null,null,null,null,null,null,null,null,null,null,"2017 - 2018"]
["UITSLAG GEWESTFINALE  :  4°  KLASSE   DRIEBANDEN  MB"]
[]
[null,"Inrichting : ",null,"KON. SINT-NIKLASE BA",null,null,null,null,null,null,null,null,null,null,null,null,null,"MIN","MAX"]
[null,"datum  : ",null,"zaterdag, 21 april 2018",null,null,null,null,null,null,null,null,null,null,18,null,null,0.33500000000000002,0.40500000000000003]
[null,null,null,null,null,null,null,null,null,null,null,null,null,null,null,null,null,null,null,null,null,null,null,null,null,null,null,null,null,"  "]
[null,"NATID","NAAM ",null,null,null,null,null,null,null,null,"CLUB",null,"WEDP","BP","Beurten","GEM 2,30","HR","OPM",null,"Pl",null,null,null,"rooster4","rooster 5","rooster 6","rooster7"]
[]
[null,7316,{"$f":"VLOOKUP(B13,LEDEN!A:B,2,FALSE)","v":"RONDELE Freddy"},null,null,null,null,null,null,null,null,{"$f":"VLOOKUP(B13,LEDEN!A:C,3,FALSE)","v":"WOH"},null,null,null,null,null,null,null,null,null,null,null,null,null,null,null,null," "]
[null,6399,{"$f":"VLOOKUP(B14,LEDEN!A:B,2,FALSE)","v":"DELAERE Marc"},null,null,null,null,null,null,null,null,null,null,null,null,null,{"$f":"IF(P14=0,\" \",TRUNC(O14/P14,2))","v":" "},null,{"$f":"IF(O14=0,\"\",IF(Q14>=X14,\"PR\",IF(Q14<W14,\"OG\",\"MG\")))","v":""},null,null,null,0.33500000000000002,0.40400000000000003,"a1","a1","a1","a1",null,"  "]
[null,null,null,null,null,null,null,null,null,null,null,null,null,null,null,null,{"$f":"IF(P15=0,\" \",TRUNC(O15/P15,2))","v":" "},null,{"$f":"IF(O15=0,\"\",IF(Q15>=X15,\"PR\",IF(Q15<W15,\"OG\",\"MG\")))","v":""},null,null,null,0.33500000000000002,0.40400000000000003,"a2","a2","a6","a4"]
[null,null,null,null,null,null,null,null,null,null,null,null,null,null,null,null," ",null,"",null,null,null,0.33500000000000002,0.40400000000000003,null,"a5","a3","a7"]
[null,null,{"$f":"VLOOKUP(B17,LEDEN!A:B,2,FALSE)","v":{"$error":"#N/A"}},null,null,null,null,null,null,null,null,null,null,null,null,null," ",null,"",null,null,null,0.33500000000000002,0.40400000000000003,null,"a3","a4","a5"]
[null,"EINDRESULTAAT",null,null,null,null,null,null,null,null,null,null,null,null,null,null,null,null,null,null,null,null,0.33500000000000002,0.40400000000000003,null,"a4","a5","a6"]
[]
[null,1046,{"$f":"VLOOKUP(B20,LEDEN!A:B,2,FALSE)","v":"BRUGGEMAN Franky"},null,null,null,null,null,null,null,null,{"$f":"VLOOKUP(B20,LEDEN!A:C,3,FALSE)","v":"K.EBC"},null,null,null,null,null,null,null,null,null,null,null,null,"a2","a2","a2","a2"]
[null,4922,{"$f":"VLOOKUP(B21,LEDEN!A:B,2,FALSE)","v":"LAUREYS Wilfried"},null,null,null,null,null,null,null,null,null,null,null,null,null,{"$f":"IF(P21=0,\" \",TRUNC(O21/P21,2))","v":" "},null,{"$f":"IF(O21=0,\"\",IF(Q21>=X21,\"PR\",IF(Q21<W21,\"OG\",\"MG\")))","v":""},null,null,null,0.33500000000000002,0.40400000000000003,"a1","a1","a6","a5"]
[null,null,null,null,null,null,null,null,null,null,null,null,null,null,null,null,{"$f":"IF(P22=0,\" \",TRUNC(O22/P22,2))","v":" "},null,{"$f":"IF(O22=0,\"\",IF(Q22>=X22,\"PR\",IF(Q22<W22,\"OG\",\"MG\")))","v":""},null,null,null,0.33500000000000002,0.40400000000000003,null,"a4","a4","a7"]
[null,null,null,null,null,null,null,null,null,null,null,null,null,null,null,null," ",null,"",null,null,null,0.33500000000000002,0.40400000000000003,null,"a5","a5","a4"]
[null,null,{"$f":"VLOOKUP(B24,LEDEN!A:B,2,FALSE)","v":{"$error":"#N/A"}},null,null,null,null,null,null,null,null,null,null,null,null,null," ",null,"",null,null,null,0.33500000000000002,0.40400000000000003,null,"a3","a3","a6"]
[null,"EINDRESULTAAT",null,null,null,null,null,null,null,null,null,null,null,null,null,null,null,null,null,null,null,null,0.33500000000000002,0.40400000000000003]
[]
[null,4922,{"$f":"VLOOKUP(B27,LEDEN!A:B,2,FALSE)","v":"LAUREYS Wilfried"},null,null,null,null,null,null,null,null,{"$f":"VLOOKUP(B27,LEDEN!A:C,3,FALSE)","v":"KSNBA"},null,null,null,null,null,null,null,null,null,null,null,null,"a3","a3","a3","a3"]
[null,1046,{"$f":"VLOOKUP(B28,LEDEN!A:B,2,FALSE)","v":"BRUGGEMAN Franky"},null,null,null,null,null,null,null,null,null,null,null,null,null,{"$f":"IF(P28=0,\" \",TRUNC(O28/P28,2))","v":" "},null,{"$f":"IF(O28=0,\"\",IF(Q28>=X28,\"PR\",IF(Q28<W28,\"OG\",\"MG\")))","v":""},null,null,null,0.33500000000000002,0.40400000000000003,"a4","a4","a5","a4"]
[null,null,null,null,null,null,null,null,null,null,null,null,null,null,null,null,{"$f":"IF(P29=0,\" \",TRUNC(O29/P29,2))","v":" "},null,{"$f":"IF(O29=0,\"\",IF(Q29>=X29,\"PR\",IF(Q29<W29,\"OG\",\"MG\")))","v":""},null,null,null,0.33500000000000002,0.40400000000000003,null,"a5","a1","a6"]
[null,null,null,null,null,null,null,null,null,null,null,null,null,null,null,null," ",null,"",null,null,null,0.33500000000000002,0.40400000000000003,null,"a1","a6","a7"]
[null,null,{"$f":"VLOOKUP(B31,LEDEN!A:B,2,FALSE)","v":{"$error":"#N/A"}},null,null,null,null,null,null,null,null,null,null,null,null,null," ",null,"",null,null,null,0.33500000000000002,0.40400000000000003,null,"a2","a2","a5"]
[null,"EINDRESULTAAT",null,null,null,null,null,null,null,null,null,null,null,null,null,null,null,null,null,null,null,null,0.33500000000000002,0.40400000000000003]
[]
[null,6399,{"$f":"VLOOKUP(B34,LEDEN!A:B,2,FALSE)","v":"DELAERE Marc"},null,null,null,null,null,null,null,null,{"$f":"VLOOKUP(B34,LEDEN!A:C,3,FALSE)","v":"K.Br"},null,null,null,null,null,null,null,null,null,null,null,null,"a4","a4","a4","a4"]
[null,7316,{"$f":"VLOOKUP(B35,LEDEN!A:B,2,FALSE)","v":"RONDELE Freddy"},null,null,null,null,null,null,null,null,null,null,null,null,null,{"$f":"IF(P35=0,\" \",TRUNC(O35/P35,2))","v":" "},null,{"$f":"IF(O35=0,\"\",IF(Q35>=X35,\"PR\",IF(Q35<W35,\"OG\",\"MG\")))","v":""},null,null,null,0.33500000000000002,0.40400000000000003,"a3","a3","a5","a1"]
[null,null,null,null,null,null,null,null,null,null,null,null,null,null,null,null,{"$f":"IF(P36=0,\" \",TRUNC(O36/P36,2))","v":" "},null,{"$f":"IF(O36=0,\"\",IF(Q36>=X36,\"PR\",IF(Q36<W36,\"OG\",\"MG\")))","v":""},null,null,null,0.33500000000000002,0.40400000000000003,null,"a2","a2","a3"]
[null,null,null,null,null,null,null,null,null,null,null,null,null,null,null,null," ",null,"",null,null,null,0.33500000000000002,0.40400000000000003,null,"a5","a1","a2"]
[null,null,{"$f":"VLOOKUP(B38,LEDEN!A:B,2,FALSE)","v":{"$error":"#N/A"}},null,null,null,null,null,null,null,null,null,null,null,null,null," ",null,"",null,null,null,0.33500000000000002,0.40400000000000003,null,"a1","a6","a6",null," "]
[null,"EINDRESULTAAT",null,null,null,null,null,null,null,null,null,null,null,null,null,null,null,null,null,null,null,null,0.33500000000000002,0.40400000000000003]
[]
[]
[]
[null,null,{"$f":"TODAY()","v":"2018-04-23"},null,null,null,null,null,null,null,null,null,null,null,null,"Verantwoordelijke "]

{"sheet":"LEDEN","index":2,"n_rows":735,"n_cols":9,"rows_kept":735,"cut":false,"hidden":false,"merged":[]}
["NATID","NAAM",null,"S","J","K","AANT/LED","TOT.DIST","2016-08-20"]
[]
[4100,{"$f":"VLOOKUP(A3,[2]Ledenlijst!$B$2:$N$707,2,FALSE)","v":"BOUSSY Werner"},{"$f":"VLOOKUP(A3,[2]Ledenlijst!$B$2:$N$707,13,FALSE)","v":"K.Kn"},{"$f":"VLOOKUP(A3,[2]Ledenlijst!$B$2:$N$707,7,FALSE)","v":"S"}]
[7678,{"$f":"VLOOKUP(A4,[2]Ledenlijst!$B$2:$N$707,2,FALSE)","v":"DE VREEZE Patrick"},{"$f":"VLOOKUP(A4,[2]Ledenlijst!$B$2:$N$707,13,FALSE)","v":"K.Kn"},{"$f":"VLOOKUP(A4,[2]Ledenlijst!$B$2:$N$707,7,FALSE)","v":"S"}]
[5178,{"$f":"VLOOKUP(A5,[2]Ledenlijst!$B$2:$N$707,2,FALSE)","v":"FRANKEN Luc"},{"$f":"VLOOKUP(A5,[2]Ledenlijst!$B$2:$N$707,13,FALSE)","v":"K.Kn"},{"$f":"VLOOKUP(A5,[2]Ledenlijst!$B$2:$N$707,7,FALSE)","v":"S"}]
[4522,{"$f":"VLOOKUP(A6,[2]Ledenlijst!$B$2:$N$707,2,FALSE)","v":"METTEPENNINGEN Julien"},{"$f":"VLOOKUP(A6,[2]Ledenlijst!$B$2:$N$707,13,FALSE)","v":"K.Kn"},{"$f":"VLOOKUP(A6,[2]Ledenlijst!$B$2:$N$707,7,FALSE)","v":"S"}]
[4114,{"$f":"VLOOKUP(A7,[2]Ledenlijst!$B$2:$N$707,2,FALSE)","v":"VAN KREIJ Jo"},{"$f":"VLOOKUP(A7,[2]Ledenlijst!$B$2:$N$707,13,FALSE)","v":"K.Kn"},{"$f":"VLOOKUP(A7,[2]Ledenlijst!$B$2:$N$707,7,FALSE)","v":"S"},null,null,{"$f":"COUNTA(A3:A7)","v":5},null,"K.Kn"]
[1102,{"$f":"VLOOKUP(A8,[2]Ledenlijst!$B$2:$N$707,2,FALSE)","v":"CALLIAUW Ludovicus"},{"$f":"VLOOKUP(A8,[2]Ledenlijst!$B$2:$N$707,13,FALSE)","v":"OS"},{"$f":"VLOOKUP(A8,[2]Ledenlijst!$B$2:$N$707,7,FALSE)","v":"S"}]
["00848",{"$f":"VLOOKUP(A9,[2]Ledenlijst!$B$2:$N$707,2,FALSE)","v":"DEVRIENDT Bart"},{"$f":"VLOOKUP(A9,[2]Ledenlijst!$B$2:$N$707,13,FALSE)","v":"OS"},null,null,{"$f":"VLOOKUP(A9,[2]Ledenlijst!$B$2:$N$707,7,FALSE)","v":"K"}]
[4119,{"$f":"VLOOKUP(A10,[2]Ledenlijst!$B$2:$N$707,2,FALSE)","v":"GEERLANDT José"},{"$f":"VLOOKUP(A10,[2]Ledenlijst!$B$2:$N$707,13,FALSE)","v":"OS"},{"$f":"VLOOKUP(A10,[2]Ledenlijst!$B$2:$N$707,7,FALSE)","v":"S"}]
[4122,{"$f":"VLOOKUP(A11,[2]Ledenlijst!$B$2:$N$707,2,FALSE)","v":"HAEGHEBAERT Eric"},{"$f":"VLOOKUP(A11,[2]Ledenlijst!$B$2:$N$707,13,FALSE)","v":"OS"},{"$f":"VLOOKUP(A11,[2]Ledenlijst!$B$2:$N$707,7,FALSE)","v":"S"}]
[6074,{"$f":"VLOOKUP(A12,[2]Ledenlijst!$B$2:$N$707,2,FALSE)","v":"MAES Hendrik"},{"$f":"VLOOKUP(A12,[2]Ledenlijst!$B$2:$N$707,13,FALSE)","v":"OS"},{"$f":"VLOOKUP(A12,[2]Ledenlijst!$B$2:$N$707,7,FALSE)","v":"S"}]
[7287,{"$f":"VLOOKUP(A13,[2]Ledenlijst!$B$2:$N$707,2,FALSE)","v":"SOENENS Joël"},{"$f":"VLOOKUP(A13,[2]Ledenlijst!$B$2:$N$707,13,FALSE)","v":"OS"},{"$f":"VLOOKUP(A13,[2]Ledenlijst!$B$2:$N$707,7,FALSE)","v":"S"}]
[8883,{"$f":"VLOOKUP(A14,[2]Ledenlijst!$B$2:$N$707,2,FALSE)","v":"VANPRAET Bart"},{"$f":"VLOOKUP(A14,[2]Ledenlijst!$B$2:$N$707,13,FALSE)","v":"OS"},{"$f":"VLOOKUP(A14,[2]Ledenlijst!$B$2:$N$707,7,FALSE)","v":"S"}]
[8668,{"$f":"VLOOKUP(A15,[2]Ledenlijst!$B$2:$N$707,2,FALSE)","v":"VANDEKEERE Bert"},{"$f":"VLOOKUP(A15,[2]Ledenlijst!$B$2:$N$707,13,FALSE)","v":"OS"},{"$f":"VLOOKUP(A15,[2]Ledenlijst!$B$2:$N$707,7,FALSE)","v":"S"}]
[7010,{"$f":"VLOOKUP(A16,[2]Ledenlijst!$B$2:$N$707,2,FALSE)","v":"VERMEULEN Johan"},{"$f":"VLOOKUP(A16,[2]Ledenlijst!$B$2:$N$707,13,FALSE)","v":"OS"},{"$f":"VLOOKUP(A16,[2]Ledenlijst!$B$2:$N$707,7,FALSE)","v":"S"}]
[4133,{"$f":"VLOOKUP(A17,[2]Ledenlijst!$B$2:$N$707,2,FALSE)","v":"WERBROUCK Luc"},{"$f":"VLOOKUP(A17,[2]Ledenlijst!$B$2:$N$707,13,FALSE)","v":"OS"},{"$f":"VLOOKUP(A17,[2]Ledenlijst!$B$2:$N$707,7,FALSE)","v":"S"},null,null,{"$f":"COUNTA(A8:A17)","v":10},null,"OS"]
[4158,{"$f":"VLOOKUP(A18,[2]Ledenlijst!$B$2:$N$707,2,FALSE)","v":"BAUWENS Freddy"},{"$f":"VLOOKUP(A18,[2]Ledenlijst!$B$2:$N$707,13,FALSE)","v":"K.ZE"},{"$f":"VLOOKUP(A18,[2]Ledenlijst!$B$2:$N$707,7,FALSE)","v":"S"}]
["00949",{"$f":"VLOOKUP(A19,[2]Ledenlijst!$B$2:$N$707,2,FALSE)","v":"BLOMME Johan"},{"$f":"VLOOKUP(A19,[2]Ledenlijst!$B$2:$N$707,13,FALSE)","v":"K.ZE"},null,null,{"$f":"VLOOKUP(A19,[2]Ledenlijst!$B$2:$N$707,7,FALSE)","v":"K"}]
["00850",{"$f":"VLOOKUP(A20,[2]Ledenlijst!$B$2:$N$707,2,FALSE)","v":"BONNY Ingrid"},{"$f":"VLOOKUP(A20,[2]Ledenlijst!$B$2:$N$707,13,FALSE)","v":"K.ZE"},null,null,{"$f":"VLOOKUP(A20,[2]Ledenlijst!$B$2:$N$707,7,FALSE)","v":"K"}]
["00852",{"$f":"VLOOKUP(A21,[2]Ledenlijst!$B$2:$N$707,2,FALSE)","v":"BULTINCK Ginette"},{"$f":"VLOOKUP(A21,[2]Ledenlijst!$B$2:$N$707,13,FALSE)","v":"K.ZE"},null,null,{"$f":"VLOOKUP(A21,[2]Ledenlijst!$B$2:$N$707,7,FALSE)","v":"K"}]
["KK",{"$f":"VLOOKUP(A22,[2]Ledenlijst!$B$2:$N$707,2,FALSE)","v":"BUYSSE Edgard"},{"$f":"VLOOKUP(A22,[2]Ledenlijst!$B$2:$N$707,13,FALSE)","v":"K.ZE"},null,null,{"$f":"VLOOKUP(A22,[2]Ledenlijst!$B$2:$N$707,7,FALSE)","v":"K"}]
[4162,{"$f":"VLOOKUP(A23,[2]Ledenlijst!$B$2:$N$707,2,FALSE)","v":"CAPPELLE Eddy"},{"$f":"VLOOKUP(A23,[2]Ledenlijst!$B$2:$N$707,13,FALSE)","v":"K.ZE"},{"$f":"VLOOKUP(A23,[2]Ledenlijst!$B$2:$N$707,7,FALSE)","v":"S"}]
["00853",{"$f":"VLOOKUP(A24,[2]Ledenlijst!$B$2:$N$707,2,FALSE)","v":"CATTRYSSE Magali"},{"$f":"VLOOKUP(A24,[2]Ledenlijst!$B$2:$N$707,13,FALSE)","v":"K.ZE"},null,null,{"$f":"VLOOKUP(A24,[2]Ledenlijst!$B$2:$N$707,7,FALSE)","v":"K"}]
[4167,{"$f":"VLOOKUP(A25,[2]Ledenlijst!$B$2:$N$707,2,FALSE)","v":"DECLERCK Gilbert"},{"$f":"VLOOKUP(A25,[2]Ledenlijst!$B$2:$N$707,13,FALSE)","v":"K.ZE"},{"$f":"VLOOKUP(A25,[2]Ledenlijst!$B$2:$N$707,7,FALSE)","v":"S"}]
[9254,{"$f":"VLOOKUP(A26,[2]Ledenlijst!$B$2:$N$707,2,FALSE)","v":"DEPRINCE Luc"},{"$f":"VLOOKUP(A26,[2]Ledenlijst!$B$2:$N$707,13,FALSE)","v":"K.ZE"},{"$f":"VLOOKUP(A26,[2]Ledenlijst!$B$2:$N$707,7,FALSE)","v":"S"}]
[4171,{"$f":"VLOOKUP(A27,[2]Ledenlijst!$B$2:$N$707,2,FALSE)","v":"FORREST Emiel"},{"$f":"VLOOKUP(A27,[2]Ledenlijst!$B$2:$N$707,13,FALSE)","v":"K.ZE"},{"$f":"VLOOKUP(A27,[2]Ledenlijst!$B$2:$N$707,7,FALSE)","v":"S"}]
["00854",{"$f":"VLOOKUP(A28,[2]Ledenlijst!$B$2:$N$707,2,FALSE)","v":"LAMBERT Marie-Thérése"},{"$f":"VLOOKUP(A28,[2]Ledenlijst!$B$2:$N$707,13,FALSE)","v":"K.ZE"},null,null,{"$f":"VLOOKUP(A28,[2]Ledenlijst!$B$2:$N$707,7,FALSE)","v":"K"}]
["00855",{"$f":"VLOOKUP(A29,[2]Ledenlijst!$B$2:$N$707,2,FALSE)","v":"MARTENS Linda"},{"$f":"VLOOKUP(A29,[2]Ledenlijst!$B$2:$N$707,13,FALSE)","v":"K.ZE"},null,null,{"$f":"VLOOKUP(A29,[2]Ledenlijst!$B$2:$N$707,7,FALSE)","v":"K"}]
["00856",{"$f":"VLOOKUP(A30,[2]Ledenlijst!$B$2:$N$707,2,FALSE)","v":"SEDED Bold"},{"$f":"VLOOKUP(A30,[2]Ledenlijst!$B$2:$N$707,13,FALSE)","v":"K.ZE"},null,null,{"$f":"VLOOKUP(A30,[2]Ledenlijst!$B$2:$N$707,7,FALSE)","v":"K"}]
["00857",{"$f":"VLOOKUP(A31,[2]Ledenlijst!$B$2:$N$707,2,FALSE)","v":"SERROELS Erwin"},{"$f":"VLOOKUP(A31,[2]Ledenlijst!$B$2:$N$707,13,FALSE)","v":"K.ZE"},null,null,{"$f":"VLOOKUP(A31,[2]Ledenlijst!$B$2:$N$707,7,FALSE)","v":"K"}]
["00858",{"$f":"VLOOKUP(A32,[2]Ledenlijst!$B$2:$N$707,2,FALSE)","v":"STUBBE Patricia"},{"$f":"VLOOKUP(A32,[2]Ledenlijst!$B$2:$N$707,13,FALSE)","v":"K.ZE"},null,null,{"$f":"VLOOKUP(A32,[2]Ledenlijst!$B$2:$N$707,7,FALSE)","v":"K"}]
["00859",{"$f":"VLOOKUP(A33,[2]Ledenlijst!$B$2:$N$707,2,FALSE)","v":"ULIN Nadine"},{"$f":"VLOOKUP(A33,[2]Ledenlijst!$B$2:$N$707,13,FALSE)","v":"K.ZE"},null,null,{"$f":"VLOOKUP(A33,[2]Ledenlijst!$B$2:$N$707,7,FALSE)","v":"K"}]
["00860",{"$f":"VLOOKUP(A34,[2]Ledenlijst!$B$2:$N$707,2,FALSE)","v":"VANDEKERCKHOVE Danny"},{"$f":"VLOOKUP(A34,[2]Ledenlijst!$B$2:$N$707,13,FALSE)","v":"K.ZE"},null,null,{"$f":"VLOOKUP(A34,[2]Ledenlijst!$B$2:$N$707,7,FALSE)","v":"K"}]
[9961,{"$f":"VLOOKUP(A35,[2]Ledenlijst!$B$2:$N$707,2,FALSE)","v":"VANDENBROELE Kurt"},{"$f":"VLOOKUP(A35,[2]Ledenlijst!$B$2:$N$707,13,FALSE)","v":"K.ZE"},{"$f":"VLOOKUP(A35,[2]Ledenlijst!$B$2:$N$707,7,FALSE)","v":"S"}]
["00861",{"$f":"VLOOKUP(A36,[2]Ledenlijst!$B$2:$N$707,2,FALSE)","v":"VANDIERENDONCK Yannick"},{"$f":"VLOOKUP(A36,[2]Ledenlijst!$B$2:$N$707,13,FALSE)","v":"K.ZE"},null,null,{"$f":"VLOOKUP(A36,[2]Ledenlijst!$B$2:$N$707,7,FALSE)","v":"K"},{"$f":"COUNTA(A18:A36)","v":19},null,"K.ZE"]
[7465,{"$f":"VLOOKUP(A37,[2]Ledenlijst!$B$2:$N$707,2,FALSE)","v":"COUSSEMENT Wim"},{"$f":"VLOOKUP(A37,[2]Ledenlijst!$B$2:$N$707,13,FALSE)","v":"DK"},{"$f":"VLOOKUP(A37,[2]Ledenlijst!$B$2:$N$707,7,FALSE)","v":"S"}]
[4180,{"$f":"VLOOKUP(A38,[2]Ledenlijst!$B$2:$N$707,2,FALSE)","v":"CONSTANT Geert"},{"$f":"VLOOKUP(A38,[2]Ledenlijst!$B$2:$N$707,13,FALSE)","v":"DK"},{"$f":"VLOOKUP(A38,[2]Ledenlijst!$B$2:$N$707,7,FALSE)","v":"S"}]
[5682,{"$f":"VLOOKUP(A39,[2]Ledenlijst!$B$2:$N$707,2,FALSE)","v":"DELANGHE Lievin"},{"$f":"VLOOKUP(A39,[2]Ledenlijst!$B$2:$N$707,13,FALSE)","v":"DK"},{"$f":"VLOOKUP(A39,[2]Ledenlijst!$B$2:$N$707,7,FALSE)","v":"S"}]
[8047,{"$f":"VLOOKUP(A40,[2]Ledenlijst!$B$2:$N$707,2,FALSE)","v":"DEVRIENDT Bart"},{"$f":"VLOOKUP(A40,[2]Ledenlijst!$B$2:$N$707,13,FALSE)","v":"DK"},null,null,{"$f":"VLOOKUP(A40,[2]Ledenlijst!$B$2:$N$707,7,FALSE)","v":"K"},{"$f":"COUNTA(A37:A40)","v":4},null,"DK"]
["KKBR",{"$f":"VLOOKUP(A41,[2]Ledenlijst!$B$2:$N$707,2,FALSE)","v":"ACX Dirk"},{"$f":"VLOOKUP(A41,[2]Ledenlijst!$B$2:$N$707,13,FALSE)","v":"K.Br"},null,null,{"$f":"VLOOKUP(A41,[2]Ledenlijst!$B$2:$N$707,7,FALSE)","v":"K"}]
[6690,{"$f":"VLOOKUP(A42,[2]Ledenlijst!$B$2:$N$707,2,FALSE)","v":"BAUWENS Etienne"},{"$f":"VLOOKUP(A42,[2]Ledenlijst!$B$2:$N$707,13,FALSE)","v":"K.Br"},{"$f":"VLOOKUP(A42,[2]Ledenlijst!$B$2:$N$707,7,FALSE)","v":"S"}]
[7797,{"$f":"VLOOKUP(A43,[2]Ledenlijst!$B$2:$N$707,2,FALSE)","v":"BEIRENS Marc"},{"$f":"VLOOKUP(A43,[2]Ledenlijst!$B$2:$N$707,13,FALSE)","v":"K.Br"},{"$f":"VLOOKUP(A43,[2]Ledenlijst!$B$2:$N$707,7,FALSE)","v":"S"}]
[4722,{"$f":"VLOOKUP(A44,[2]Ledenlijst!$B$2:$N$707,2,FALSE)","v":"BLAUWBLOMME Henk"},{"$f":"VLOOKUP(A44,[2]Ledenlijst!$B$2:$N$707,13,FALSE)","v":"K.Br"},{"$f":"VLOOKUP(A44,[2]Ledenlijst!$B$2:$N$707,7,FALSE)","v":"S"}]
[5685,{"$f":"VLOOKUP(A45,[2]Ledenlijst!$B$2:$N$707,2,FALSE)","v":"BOECKAERT Eric"},{"$f":"VLOOKUP(A45,[2]Ledenlijst!$B$2:$N$707,13,FALSE)","v":"K.Br"},{"$f":"VLOOKUP(A45,[2]Ledenlijst!$B$2:$N$707,7,FALSE)","v":"S"}]
[7462,{"$f":"VLOOKUP(A46,[2]Ledenlijst!$B$2:$N$707,2,FALSE)","v":"CREYF Fernand"},{"$f":"VLOOKUP(A46,[2]Ledenlijst!$B$2:$N$707,13,FALSE)","v":"K.Br"},{"$f":"VLOOKUP(A46,[2]Ledenlijst!$B$2:$N$707,7,FALSE)","v":"S"}]
[8921,{"$f":"VLOOKUP(A47,[2]Ledenlijst!$B$2:$N$707,2,FALSE)","v":"CHRISTIAENS Danny"},{"$f":"VLOOKUP(A47,[2]Ledenlijst!$B$2:$N$707,13,FALSE)","v":"K.Br"},{"$f":"VLOOKUP(A47,[2]Ledenlijst!$B$2:$N$707,7,FALSE)","v":"S"}]
[9256,{"$f":"VLOOKUP(A48,[2]Ledenlijst!$B$2:$N$707,2,FALSE)","v":"DALLINGA Louis"},{"$f":"VLOOKUP(A48,[2]Ledenlijst!$B$2:$N$707,13,FALSE)","v":"K.Br"},{"$f":"VLOOKUP(A48,[2]Ledenlijst!$B$2:$N$707,7,FALSE)","v":"S"}]
[4071,{"$f":"VLOOKUP(A49,[2]Ledenlijst!$B$2:$N$707,2,FALSE)","v":"DE BAERE Eddy"},{"$f":"VLOOKUP(A49,[2]Ledenlijst!$B$2:$N$707,13,FALSE)","v":"K.Br"},{"$f":"VLOOKUP(A49,[2]Ledenlijst!$B$2:$N$707,7,FALSE)","v":"S"}]
[9062,{"$f":"VLOOKUP(A50,[2]Ledenlijst!$B$2:$N$707,2,FALSE)","v":"DE BUSSCHER Walter"},{"$f":"VLOOKUP(A50,[2]Ledenlijst!$B$2:$N$707,13,FALSE)","v":"K.Br"},{"$f":"VLOOKUP(A50,[2]Ledenlijst!$B$2:$N$707,7,FALSE)","v":"S"}]
["00864",{"$f":"VLOOKUP(A51,[2]Ledenlijst!$B$2:$N$707,2,FALSE)","v":"DECLERCK Gilbert"},{"$f":"VLOOKUP(A51,[2]Ledenlijst!$B$2:$N$707,13,FALSE)","v":"K.Br"},null,null,{"$f":"VLOOKUP(A51,[2]Ledenlijst!$B$2:$N$707,7,FALSE)","v":"K"}]
[8669,{"$f":"VLOOKUP(A52,[2]Ledenlijst!$B$2:$N$707,2,FALSE)","v":"DE CLERCK Jean"},{"$f":"VLOOKUP(A52,[2]Ledenlijst!$B$2:$N$707,13,FALSE)","v":"K.Br"},{"$f":"VLOOKUP(A52,[2]Ledenlijst!$B$2:$N$707,7,FALSE)","v":"S"}]
[6678,{"$f":"VLOOKUP(A53,[2]Ledenlijst!$B$2:$N$707,2,FALSE)","v":"DE CORTE Jan"},{"$f":"VLOOKUP(A53,[2]Ledenlijst!$B$2:$N$707,13,FALSE)","v":"K.Br"},{"$f":"VLOOKUP(A53,[2]Ledenlijst!$B$2:$N$707,7,FALSE)","v":"S"}]
[4148,{"$f":"VLOOKUP(A54,[2]Ledenlijst!$B$2:$N$707,2,FALSE)","v":"DE CUYPER René"},{"$f":"VLOOKUP(A54,[2]Ledenlijst!$B$2:$N$707,13,FALSE)","v":"K.Br"},{"$f":"VLOOKUP(A54,[2]Ledenlijst!$B$2:$N$707,7,FALSE)","v":"S"}]
[4147,{"$f":"VLOOKUP(A55,[2]Ledenlijst!$B$2:$N$707,2,FALSE)","v":"D'HONT Steven"},{"$f":"VLOOKUP(A55,[2]Ledenlijst!$B$2:$N$707,13,FALSE)","v":"K.Br"},{"$f":"VLOOKUP(A55,[2]Ledenlijst!$B$2:$N$707,7,FALSE)","v":"S"}]
[8362,{"$f":"VLOOKUP(A56,[2]Ledenlijst!$B$2:$N$707,2,FALSE)","v":"DE KRAKER Jean Paul"},{"$f":"VLOOKUP(A56,[2]Ledenlijst!$B$2:$N$707,13,FALSE)","v":"K.Br."},{"$f":"VLOOKUP(A56,[2]Ledenlijst!$B$2:$N$707,7,FALSE)","v":"S"}]
[6399,{"$f":"VLOOKUP(A57,[2]Ledenlijst!$B$2:$N$707,2,FALSE)","v":"DELAERE Marc"},{"$f":"VLOOKUP(A57,[2]Ledenlijst!$B$2:$N$707,13,FALSE)","v":"K.Br"},{"$f":"VLOOKUP(A57,[2]Ledenlijst!$B$2:$N$707,7,FALSE)","v":"S"}]
["4185B",{"$f":"VLOOKUP(A58,[2]Ledenlijst!$B$2:$N$707,2,FALSE)","v":"DEPOORTER Daniel"},{"$f":"VLOOKUP(A58,[2]Ledenlijst!$B$2:$N$707,13,FALSE)","v":"K.Br"},{"$f":"VLOOKUP(A58,[2]Ledenlijst!$B$2:$N$707,7,FALSE)","v":"S"}]
[4222,{"$f":"VLOOKUP(A59,[2]Ledenlijst!$B$2:$N$707,2,FALSE)","v":"DEQUEKER Guido"},{"$f":"VLOOKUP(A59,[2]Ledenlijst!$B$2:$N$707,13,FALSE)","v":"K.Br"},{"$f":"VLOOKUP(A59,[2]Ledenlijst!$B$2:$N$707,7,FALSE)","v":"S"}]
[4150,{"$f":"VLOOKUP(A60,[2]Ledenlijst!$B$2:$N$707,2,FALSE)","v":"DEVROE Eddy"},{"$f":"VLOOKUP(A60,[2]Ledenlijst!$B$2:$N$707,13,FALSE)","v":"K.Br"},{"$f":"VLOOKUP(A60,[2]Ledenlijst!$B$2:$N$707,7,FALSE)","v":"S"}]
[5439,{"$f":"VLOOKUP(A61,[2]Ledenlijst!$B$2:$N$707,2,FALSE)","v":"DUCHEYNE Kenny"},{"$f":"VLOOKUP(A61,[2]Ledenlijst!$B$2:$N$707,13,FALSE)","v":"K.Br"},{"$f":"VLOOKUP(A61,[2]Ledenlijst!$B$2:$N$707,7,FALSE)","v":"S"}]
[4644,{"$f":"VLOOKUP(A62,[2]Ledenlijst!$B$2:$N$707,2,FALSE)","v":"DUMON Dirk"},{"$f":"VLOOKUP(A62,[2]Ledenlijst!$B$2:$N$707,13,FALSE)","v":"K.Br"},{"$f":"VLOOKUP(A62,[2]Ledenlijst!$B$2:$N$707,7,FALSE)","v":"S"}]
[6680,{"$f":"VLOOKUP(A63,[2]Ledenlijst!$B$2:$N$707,2,FALSE)","v":"FLAMEE Kurt"},{"$f":"VLOOKUP(A63,[2]Ledenlijst!$B$2:$N$707,13,FALSE)","v":"K.Br"},{"$f":"VLOOKUP(A63,[2]Ledenlijst!$B$2:$N$707,7,FALSE)","v":"S"}]
[4224,{"$f":"VLOOKUP(A64,[2]Ledenlijst!$B$2:$N$707,2,FALSE)","v":"GUIDE Jean-Pierre"},{"$f":"VLOOKUP(A64,[2]Ledenlijst!$B$2:$N$707,13,FALSE)","v":"K.Br"},{"$f":"VLOOKUP(A64,[2]Ledenlijst!$B$2:$N$707,7,FALSE)","v":"S"}]
[7795,{"$f":"VLOOKUP(A65,[2]Ledenlijst!$B$2:$N$707,2,FALSE)","v":"HACKE Jean-Marie"},{"$f":"VLOOKUP(A65,[2]Ledenlijst!$B$2:$N$707,13,FALSE)","v":"K.Br"},{"$f":"VLOOKUP(A65,[2]Ledenlijst!$B$2:$N$707,7,FALSE)","v":"S"}]
[8881,{"$f":"VLOOKUP(A66,[2]Ledenlijst!$B$2:$N$707,2,FALSE)","v":"HERPOEL Rony"},{"$f":"VLOOKUP(A66,[2]Ledenlijst!$B$2:$N$707,13,FALSE)","v":"K.Br"},{"$f":"VLOOKUP(A66,[2]Ledenlijst!$B$2:$N$707,7,FALSE)","v":"S"}]
[4779,{"$f":"VLOOKUP(A67,[2]Ledenlijst!$B$2:$N$707,2,FALSE)","v":"LEYS Bart"},{"$f":"VLOOKUP(A67,[2]Ledenlijst!$B$2:$N$707,13,FALSE)","v":"K.Br"},{"$f":"VLOOKUP(A67,[2]Ledenlijst!$B$2:$N$707,7,FALSE)","v":"S"}]
[9257,{"$f":"VLOOKUP(A68,[2]Ledenlijst!$B$2:$N$707,2,FALSE)","v":"MUS Hendrik"},{"$f":"VLOOKUP(A68,[2]Ledenlijst!$B$2:$N$707,13,FALSE)","v":"K.Br"},{"$f":"VLOOKUP(A68,[2]Ledenlijst!$B$2:$N$707,7,FALSE)","v":"S"}]
[4363,{"$f":"VLOOKUP(A69,[2]Ledenlijst!$B$2:$N$707,2,FALSE)","v":"PRIEUS Andy"},{"$f":"VLOOKUP(A69,[2]Ledenlijst!$B$2:$N$707,13,FALSE)","v":"K.Br."},{"$f":"VLOOKUP(A69,[2]Ledenlijst!$B$2:$N$707,7,FALSE)","v":"S"}]
[6081,{"$f":"VLOOKUP(A70,[2]Ledenlijst!$B$2:$N$707,2,FALSE)","v":"QUITTELIER Stephan"},{"$f":"VLOOKUP(A70,[2]Ledenlijst!$B$2:$N$707,13,FALSE)","v":"K.Br"},{"$f":"VLOOKUP(A70,[2]Ledenlijst!$B$2:$N$707,7,FALSE)","v":"S"}]
[4187,{"$f":"VLOOKUP(A71,[2]Ledenlijst!$B$2:$N$707,2,FALSE)","v":"ROGIERS Marc"},{"$f":"VLOOKUP(A71,[2]Ledenlijst!$B$2:$N$707,13,FALSE)","v":"K.Br"},{"$f":"VLOOKUP(A71,[2]Ledenlijst!$B$2:$N$707,7,FALSE)","v":"S"}]
[5689,{"$f":"VLOOKUP(A72,[2]Ledenlijst!$B$2:$N$707,2,FALSE)","v":"SAVER Koen"},{"$f":"VLOOKUP(A72,[2]Ledenlijst!$B$2:$N$707,13,FALSE)","v":"K.Br"},{"$f":"VLOOKUP(A72,[2]Ledenlijst!$B$2:$N$707,7,FALSE)","v":"S"}]
[8670,{"$f":"VLOOKUP(A73,[2]Ledenlijst!$B$2:$N$707,2,FALSE)","v":"SCHOE Henk"},{"$f":"VLOOKUP(A73,[2]Ledenlijst!$B$2:$N$707,13,FALSE)","v":"K.Br"},{"$f":"VLOOKUP(A73,[2]Ledenlijst!$B$2:$N$707,7,FALSE)","v":"S"}]
["4682B",{"$f":"VLOOKUP(A74,[2]Ledenlijst!$B$2:$N$707,2,FALSE)","v":"SCHOUTETENS Pieter"},{"$f":"VLOOKUP(A74,[2]Ledenlijst!$B$2:$N$707,13,FALSE)","v":"K.Br"},{"$f":"VLOOKUP(A74,[2]Ledenlijst!$B$2:$N$707,7,FALSE)","v":"S"}]
[4557,{"$f":"VLOOKUP(A75,[2]Ledenlijst!$B$2:$N$707,2,FALSE)","v":"SERWEYTENS Lieven"},{"$f":"VLOOKUP(A75,[2]Ledenlijst!$B$2:$N$707,13,FALSE)","v":"K.Br"},{"$f":"VLOOKUP(A75,[2]Ledenlijst!$B$2:$N$707,7,FALSE)","v":"S"}]
[8162,{"$f":"VLOOKUP(A76,[2]Ledenlijst!$B$2:$N$707,2,FALSE)","v":"SEYS Herbert"},{"$f":"VLOOKUP(A76,[2]Ledenlijst!$B$2:$N$707,13,FALSE)","v":"K.Br"},{"$f":"VLOOKUP(A76,[2]Ledenlijst!$B$2:$N$707,7,FALSE)","v":"S"}]
[4156,{"$f":"VLOOKUP(A77,[2]Ledenlijst!$B$2:$N$707,2,FALSE)","v":"SEYS Norbert"},{"$f":"VLOOKUP(A77,[2]Ledenlijst!$B$2:$N$707,13,FALSE)","v":"K.Br"},{"$f":"VLOOKUP(A77,[2]Ledenlijst!$B$2:$N$707,7,FALSE)","v":"S"}]
[9258,{"$f":"VLOOKUP(A78,[2]Ledenlijst!$B$2:$N$707,2,FALSE)","v":"STEFFENS Alain"},{"$f":"VLOOKUP(A78,[2]Ledenlijst!$B$2:$N$707,13,FALSE)","v":"K.Br"},{"$f":"VLOOKUP(A78,[2]Ledenlijst!$B$2:$N$707,7,FALSE)","v":"S"}]
[8454,{"$f":"VLOOKUP(A79,[2]Ledenlijst!$B$2:$N$707,2,FALSE)","v":"STUYVAERT Marijn"},{"$f":"VLOOKUP(A79,[2]Ledenlijst!$B$2:$N$707,13,FALSE)","v":"K.Br"},{"$f":"VLOOKUP(A79,[2]Ledenlijst!$B$2:$N$707,7,FALSE)","v":"S"}]
[5691,{"$f":"VLOOKUP(A80,[2]Ledenlijst!$B$2:$N$707,2,FALSE)","v":"TORRES Manuel"},{"$f":"VLOOKUP(A80,[2]Ledenlijst!$B$2:$N$707,13,FALSE)","v":"K.Br"},{"$f":"VLOOKUP(A80,[2]Ledenlijst!$B$2:$N$707,7,FALSE)","v":"S"}]
[2944,{"$f":"VLOOKUP(A81,[2]Ledenlijst!$B$2:$N$707,2,FALSE)","v":"'T SEYEN Roland"},{"$f":"VLOOKUP(A81,[2]Ledenlijst!$B$2:$N$707,13,FALSE)","v":"K.Br"},{"$f":"VLOOKUP(A81,[2]Ledenlijst!$B$2:$N$707,7,FALSE)","v":"S"}]
[4267,{"$f":"VLOOKUP(A82,[2]Ledenlijst!$B$2:$N$707,2,FALSE)","v":"THOMAS Peter"},{"$f":"VLOOKUP(A82,[2]Ledenlijst!$B$2:$N$707,13,FALSE)","v":"K.Br"},{"$f":"VLOOKUP(A82,[2]Ledenlijst!$B$2:$N$707,7,FALSE)","v":"S"}]
[5408,{"$f":"VLOOKUP(A83,[2]Ledenlijst!$B$2:$N$707,2,FALSE)","v":"VANRAPENBUSCH Franky"},{"$f":"VLOOKUP(A83,[2]Ledenlijst!$B$2:$N$707,13,FALSE)","v":"K.Br."},{"$f":"VLOOKUP(A83,[2]Ledenlijst!$B$2:$N$707,7,FALSE)","v":"S"}]
[7529,{"$f":"VLOOKUP(A84,[2]Ledenlijst!$B$2:$N$707,2,FALSE)","v":"VASSEUR Patrick"},{"$f":"VLOOKUP(A84,[2]Ledenlijst!$B$2:$N$707,13,FALSE)","v":"K.Br"},{"$f":"VLOOKUP(A84,[2]Ledenlijst!$B$2:$N$707,7,FALSE)","v":"S"}]
[4242,{"$f":"VLOOKUP(A85,[2]Ledenlijst!$B$2:$N$707,2,FALSE)","v":"VERCRUYSSE Johan"},{"$f":"VLOOKUP(A85,[2]Ledenlijst!$B$2:$N$707,13,FALSE)","v":"K.Br"},{"$f":"VLOOKUP(A85,[2]Ledenlijst!$B$2:$N$707,7,FALSE)","v":"S"},null,null,{"$f":"COUNTA(A41:A85)","v":45},null,"K.Br"]
[4065,{"$f":"VLOOKUP(A86,[2]Ledenlijst!$B$2:$N$707,2,FALSE)","v":"BAERT Rony"},{"$f":"VLOOKUP(A86,[2]Ledenlijst!$B$2:$N$707,13,FALSE)","v":"OBA"},{"$f":"VLOOKUP(A86,[2]Ledenlijst!$B$2:$N$707,7,FALSE)","v":"S"}]
["4158B",{"$f":"VLOOKUP(A87,[2]Ledenlijst!$B$2:$N$707,2,FALSE)","v":"BAUWENS Freddy"},{"$f":"VLOOKUP(A87,[2]Ledenlijst!$B$2:$N$707,13,FALSE)","v":"OBA"},{"$f":"VLOOKUP(A87,[2]Ledenlijst!$B$2:$N$707,7,FALSE)","v":"S"}]
[4246,{"$f":"VLOOKUP(A88,[2]Ledenlijst!$B$2:$N$707,2,FALSE)","v":"BOLLE Jean-Marie"},{"$f":"VLOOKUP(A88,[2]Ledenlijst!$B$2:$N$707,13,FALSE)","v":"OBA"},{"$f":"VLOOKUP(A88,[2]Ledenlijst!$B$2:$N$707,7,FALSE)","v":"S"}]
["00865",{"$f":"VLOOKUP(A89,[2]Ledenlijst!$B$2:$N$707,2,FALSE)","v":"BONCHAK Svitlana"},{"$f":"VLOOKUP(A89,[2]Ledenlijst!$B$2:$N$707,13,FALSE)","v":"OBA"},null,null,{"$f":"VLOOKUP(A89,[2]Ledenlijst!$B$2:$N$707,7,FALSE)","v":"K"}]
[4247,{"$f":"VLOOKUP(A90,[2]Ledenlijst!$B$2:$N$707,2,FALSE)","v":"BORNY Franky"},{"$f":"VLOOKUP(A90,[2]Ledenlijst!$B$2:$N$707,13,FALSE)","v":"OBA"},{"$f":"VLOOKUP(A90,[2]Ledenlijst!$B$2:$N$707,7,FALSE)","v":"S"}]
[9296,{"$f":"VLOOKUP(A91,[2]Ledenlijst!$B$2:$N$707,2,FALSE)","v":"BORREMANS Edouard"},{"$f":"VLOOKUP(A91,[2]Ledenlijst!$B$2:$N$707,13,FALSE)","v":"OBA"},{"$f":"VLOOKUP(A91,[2]Ledenlijst!$B$2:$N$707,7,FALSE)","v":"S"}]
[4249,{"$f":"VLOOKUP(A92,[2]Ledenlijst!$B$2:$N$707,2,FALSE)","v":"BRISSINCK Danny"},{"$f":"VLOOKUP(A92,[2]Ledenlijst!$B$2:$N$707,13,FALSE)","v":"OBA"},{"$f":"VLOOKUP(A92,[2]Ledenlijst!$B$2:$N$707,7,FALSE)","v":"S"}]
["00866",{"$f":"VLOOKUP(A93,[2]Ledenlijst!$B$2:$N$707,2,FALSE)","v":"CANNOODT Christiane"},{"$f":"VLOOKUP(A93,[2]Ledenlijst!$B$2:$N$707,13,FALSE)","v":"OBA"},null,null,{"$f":"VLOOKUP(A93,[2]Ledenlijst!$B$2:$N$707,7,FALSE)","v":"K"}]
["4162B",{"$f":"VLOOKUP(A94,[2]Ledenlijst!$B$2:$N$707,2,FALSE)","v":"CAPPELLE Eddy"},{"$f":"VLOOKUP(A94,[2]Ledenlijst!$B$2:$N$707,13,FALSE)","v":"OBA"},{"$f":"VLOOKUP(A94,[2]Ledenlijst!$B$2:$N$707,7,FALSE)","v":"S"}]
[1376,{"$f":"VLOOKUP(A95,[2]Ledenlijst!$B$2:$N$707,2,FALSE)","v":"CEULEMANS Lodewijck"},{"$f":"VLOOKUP(A95,[2]Ledenlijst!$B$2:$N$707,13,FALSE)","v":"OBA"},{"$f":"VLOOKUP(A95,[2]Ledenlijst!$B$2:$N$707,7,FALSE)","v":"S"}]
[4250,{"$f":"VLOOKUP(A96,[2]Ledenlijst!$B$2:$N$707,2,FALSE)","v":"COBBAERT Thierry"},{"$f":"VLOOKUP(A96,[2]Ledenlijst!$B$2:$N$707,13,FALSE)","v":"OBA"},{"$f":"VLOOKUP(A96,[2]Ledenlijst!$B$2:$N$707,7,FALSE)","v":"S"}]
["00902",{"$f":"VLOOKUP(A97,[2]Ledenlijst!$B$2:$N$707,2,FALSE)","v":"COOLS Cathérine"},{"$f":"VLOOKUP(A97,[2]Ledenlijst!$B$2:$N$707,13,FALSE)","v":"OBA"},null,null,{"$f":"VLOOKUP(A97,[2]Ledenlijst!$B$2:$N$707,7,FALSE)","v":"K"}]
["00607",{"$f":"VLOOKUP(A98,[2]Ledenlijst!$B$2:$N$707,2,FALSE)","v":"CUVELIER Ann"},{"$f":"VLOOKUP(A98,[2]Ledenlijst!$B$2:$N$707,13,FALSE)","v":"OBA"},null,null,{"$f":"VLOOKUP(A98,[2]Ledenlijst!$B$2:$N$707,7,FALSE)","v":"K"}]
["00653",{"$f":"VLOOKUP(A99,[2]Ledenlijst!$B$2:$N$707,2,FALSE)","v":"DE CLERCK Jeanine"},{"$f":"VLOOKUP(A99,[2]Ledenlijst!$B$2:$N$707,13,FALSE)","v":"OBA"},null,null,{"$f":"VLOOKUP(A99,[2]Ledenlijst!$B$2:$N$707,7,FALSE)","v":"K"}]
[4252,{"$f":"VLOOKUP(A100,[2]Ledenlijst!$B$2:$N$707,2,FALSE)","v":"DEJONGHE Freddy"},{"$f":"VLOOKUP(A100,[2]Ledenlijst!$B$2:$N$707,13,FALSE)","v":"OBA"},{"$f":"VLOOKUP(A100,[2]Ledenlijst!$B$2:$N$707,7,FALSE)","v":"S"}]
["00904",{"$f":"VLOOKUP(A101,[2]Ledenlijst!$B$2:$N$707,2,FALSE)","v":"DELVA Rita"},{"$f":"VLOOKUP(A101,[2]Ledenlijst!$B$2:$N$707,13,FALSE)","v":"OBA"},null,null,{"$f":"VLOOKUP(A101,[2]Ledenlijst!$B$2:$N$707,7,FALSE)","v":"K"}]
[4635,{"$f":"VLOOKUP(A102,[2]Ledenlijst!$B$2:$N$707,2,FALSE)","v":"DEVLIEGER Raoul"},{"$f":"VLOOKUP(A102,[2]Ledenlijst!$B$2:$N$707,13,FALSE)","v":"OBA"},{"$f":"VLOOKUP(A102,[2]Ledenlijst!$B$2:$N$707,7,FALSE)","v":"S"}]
[7802,{"$f":"VLOOKUP(A103,[2]Ledenlijst!$B$2:$N$707,2,FALSE)","v":"DOUCHAMPS Olivier"},{"$f":"VLOOKUP(A103,[2]Ledenlijst!$B$2:$N$707,13,FALSE)","v":"OBA"},{"$f":"VLOOKUP(A103,[2]Ledenlijst!$B$2:$N$707,7,FALSE)","v":"S"}]
["00868",{"$f":"VLOOKUP(A104,[2]Ledenlijst!$B$2:$N$707,2,FALSE)","v":"EECKHOUT Vera"},{"$f":"VLOOKUP(A104,[2]Ledenlijst!$B$2:$N$707,13,FALSE)","v":"OBA"},null,null,{"$f":"VLOOKUP(A104,[2]Ledenlijst!$B$2:$N$707,7,FALSE)","v":"K"}]
[9414,{"$f":"VLOOKUP(A105,[2]Ledenlijst!$B$2:$N$707,2,FALSE)","v":"EUSSEN Gerardus"},{"$f":"VLOOKUP(A105,[2]Ledenlijst!$B$2:$N$707,13,FALSE)","v":"OBA"},{"$f":"VLOOKUP(A105,[2]Ledenlijst!$B$2:$N$707,7,FALSE)","v":"S"}]
[4254,{"$f":"VLOOKUP(A106,[2]Ledenlijst!$B$2:$N$707,2,FALSE)","v":"EVERAERT Luc"},{"$f":"VLOOKUP(A106,[2]Ledenlijst!$B$2:$N$707,13,FALSE)","v":"OBA"},{"$f":"VLOOKUP(A106,[2]Ledenlijst!$B$2:$N$707,7,FALSE)","v":"S"}]
[8045,{"$f":"VLOOKUP(A107,[2]Ledenlijst!$B$2:$N$707,2,FALSE)","v":"GARRE Roger"},{"$f":"VLOOKUP(A107,[2]Ledenlijst!$B$2:$N$707,13,FALSE)","v":"OBA"},{"$f":"VLOOKUP(A107,[2]Ledenlijst!$B$2:$N$707,7,FALSE)","v":"S"}]
["00870",{"$f":"VLOOKUP(A108,[2]Ledenlijst!$B$2:$N$707,2,FALSE)","v":"GEERLANDT José"},{"$f":"VLOOKUP(A108,[2]Ledenlijst!$B$2:$N$707,13,FALSE)","v":"OBA"},null,null,{"$f":"VLOOKUP(A108,[2]Ledenlijst!$B$2:$N$707,7,FALSE)","v":"K"}]
[9977,{"$f":"VLOOKUP(A109,[2]Ledenlijst!$B$2:$N$707,2,FALSE)","v":"GOEMAERE Yves"},{"$f":"VLOOKUP(A109,[2]Ledenlijst!$B$2:$N$707,13,FALSE)","v":"OBA"},{"$f":"VLOOKUP(A109,[2]Ledenlijst!$B$2:$N$707,7,FALSE)","v":"S"}]
[8917,{"$f":"VLOOKUP(A110,[2]Ledenlijst!$B$2:$N$707,2,FALSE)","v":"GREMAIN Gino"},{"$f":"VLOOKUP(A110,[2]Ledenlijst!$B$2:$N$707,13,FALSE)","v":"OBA"},{"$f":"VLOOKUP(A110,[2]Ledenlijst!$B$2:$N$707,7,FALSE)","v":"S"}]
[4256,{"$f":"VLOOKUP(A111,[2]Ledenlijst!$B$2:$N$707,2,FALSE)","v":"HELSMOORTEL Rik"},{"$f":"VLOOKUP(A111,[2]Ledenlijst!$B$2:$N$707,13,FALSE)","v":"OBA"},{"$f":"VLOOKUP(A111,[2]Ledenlijst!$B$2:$N$707,7,FALSE)","v":"S"}]
["00871",{"$f":"VLOOKUP(A112,[2]Ledenlijst!$B$2:$N$707,2,FALSE)","v":"HERMAN Arlette"},{"$f":"VLOOKUP(A112,[2]Ledenlijst!$B$2:$N$707,13,FALSE)","v":"OBA"},null,null,{"$f":"VLOOKUP(A112,[2]Ledenlijst!$B$2:$N$707,7,FALSE)","v":"K"}]
["00872",{"$f":"VLOOKUP(A113,[2]Ledenlijst!$B$2:$N$707,2,FALSE)","v":"LAMMENS Robert"},{"$f":"VLOOKUP(A113,[2]Ledenlijst!$B$2:$N$707,13,FALSE)","v":"OBA"},null,null,{"$f":"VLOOKUP(A113,[2]Ledenlijst!$B$2:$N$707,7,FALSE)","v":"K"}]
[9253,{"$f":"VLOOKUP(A114,[2]Ledenlijst!$B$2:$N$707,2,FALSE)","v":"LINTHOUT Freddy"},{"$f":"VLOOKUP(A114,[2]Ledenlijst!$B$2:$N$707,13,FALSE)","v":"OBA"},{"$f":"VLOOKUP(A114,[2]Ledenlijst!$B$2:$N$707,7,FALSE)","v":"S"}]
[8296,{"$f":"VLOOKUP(A115,[2]Ledenlijst!$B$2:$N$707,2,FALSE)","v":"MAES Jozef"},{"$f":"VLOOKUP(A115,[2]Ledenlijst!$B$2:$N$707,13,FALSE)","v":"OBA"},{"$f":"VLOOKUP(A115,[2]Ledenlijst!$B$2:$N$707,7,FALSE)","v":"S"}]
["00621",{"$f":"VLOOKUP(A116,[2]Ledenlijst!$B$2:$N$707,2,FALSE)","v":"MESSENS Isabelle"},{"$f":"VLOOKUP(A116,[2]Ledenlijst!$B$2:$N$707,13,FALSE)","v":"OBA"},null,null,{"$f":"VLOOKUP(A116,[2]Ledenlijst!$B$2:$N$707,7,FALSE)","v":"K"}]
[6456,{"$f":"VLOOKUP(A117,[2]Ledenlijst!$B$2:$N$707,2,FALSE)","v":"PLOVIE Herbert"},{"$f":"VLOOKUP(A117,[2]Ledenlijst!$B$2:$N$707,13,FALSE)","v":"OBA"},{"$f":"VLOOKUP(A117,[2]Ledenlijst!$B$2:$N$707,7,FALSE)","v":"S"}]
[5900,{"$f":"VLOOKUP(A118,[2]Ledenlijst!$B$2:$N$707,2,FALSE)","v":"PUYSTIENS Stephan"},{"$f":"VLOOKUP(A118,[2]Ledenlijst!$B$2:$N$707,13,FALSE)","v":"OBA"},{"$f":"VLOOKUP(A118,[2]Ledenlijst!$B$2:$N$707,7,FALSE)","v":"S"}]
[7466,{"$f":"VLOOKUP(A119,[2]Ledenlijst!$B$2:$N$707,2,FALSE)","v":"ROBYN Willy"},{"$f":"VLOOKUP(A119,[2]Ledenlijst!$B$2:$N$707,13,FALSE)","v":"OBA"},{"$f":"VLOOKUP(A119,[2]Ledenlijst!$B$2:$N$707,7,FALSE)","v":"S"}]
["00900",{"$f":"VLOOKUP(A120,[2]Ledenlijst!$B$2:$N$707,2,FALSE)","v":"RYCKEWAERT Sonja"},{"$f":"VLOOKUP(A120,[2]Ledenlijst!$B$2:$N$707,13,FALSE)","v":"OBA"},null,null,{"$f":"VLOOKUP(A120,[2]Ledenlijst!$B$2:$N$707,7,FALSE)","v":"K"}]
[4262,{"$f":"VLOOKUP(A121,[2]Ledenlijst!$B$2:$N$707,2,FALSE)","v":"SANCTORUM Daniel"},{"$f":"VLOOKUP(A121,[2]Ledenlijst!$B$2:$N$707,13,FALSE)","v":"OBA"},{"$f":"VLOOKUP(A121,[2]Ledenlijst!$B$2:$N$707,7,FALSE)","v":"S"}]
[4263,{"$f":"VLOOKUP(A122,[2]Ledenlijst!$B$2:$N$707,2,FALSE)","v":"SCHLAPA Harald"},{"$f":"VLOOKUP(A122,[2]Ledenlijst!$B$2:$N$707,13,FALSE)","v":"OBA"},{"$f":"VLOOKUP(A122,[2]Ledenlijst!$B$2:$N$707,7,FALSE)","v":"S"}]
[9969,{"$f":"VLOOKUP(A123,[2]Ledenlijst!$B$2:$N$707,2,FALSE)","v":"SPILIERS Marc"},{"$f":"VLOOKUP(A123,[2]Ledenlijst!$B$2:$N$707,13,FALSE)","v":"OBA"},{"$f":"VLOOKUP(A123,[2]Ledenlijst!$B$2:$N$707,7,FALSE)","v":"S"}]
[4264,{"$f":"VLOOKUP(A124,[2]Ledenlijst!$B$2:$N$707,2,FALSE)","v":"STEEN Gilbert"},{"$f":"VLOOKUP(A124,[2]Ledenlijst!$B$2:$N$707,13,FALSE)","v":"OBA"},{"$f":"VLOOKUP(A124,[2]Ledenlijst!$B$2:$N$707,7,FALSE)","v":"S"}]
[4265,{"$f":"VLOOKUP(A125,[2]Ledenlijst!$B$2:$N$707,2,FALSE)","v":"STEMGEE Hugo"},{"$f":"VLOOKUP(A125,[2]Ledenlijst!$B$2:$N$707,13,FALSE)","v":"OBA"},{"$f":"VLOOKUP(A125,[2]Ledenlijst!$B$2:$N$707,7,FALSE)","v":"S"}]
[4269,{"$f":"VLOOKUP(A126,[2]Ledenlijst!$B$2:$N$707,2,FALSE)","v":"TRATSAERT Daniel"},{"$f":"VLOOKUP(A126,[2]Ledenlijst!$B$2:$N$707,13,FALSE)","v":"OBA"},{"$f":"VLOOKUP(A126,[2]Ledenlijst!$B$2:$N$707,7,FALSE)","v":"S"}]
[2228,{"$f":"VLOOKUP(A127,[2]Ledenlijst!$B$2:$N$707,2,FALSE)","v":"VAN BENEDEN Alain"},{"$f":"VLOOKUP(A127,[2]Ledenlijst!$B$2:$N$707,13,FALSE)","v":"OBA"},{"$f":"VLOOKUP(A127,[2]Ledenlijst!$B$2:$N$707,7,FALSE)","v":"S"}]
[9989,{"$f":"VLOOKUP(A128,[2]Ledenlijst!$B$2:$N$707,2,FALSE)","v":"VAN BOGAERT Marc"},{"$f":"VLOOKUP(A128,[2]Ledenlijst!$B$2:$N$707,13,FALSE)","v":"OBA"},{"$f":"VLOOKUP(A128,[2]Ledenlijst!$B$2:$N$707,7,FALSE)","v":"S"}]
[9993,{"$f":"VLOOKUP(A129,[2]Ledenlijst!$B$2:$N$707,2,FALSE)","v":"VAN den BERGEN Joel"},{"$f":"VLOOKUP(A129,[2]Ledenlijst!$B$2:$N$707,13,FALSE)","v":"OBA"},{"$f":"VLOOKUP(A129,[2]Ledenlijst!$B$2:$N$707,7,FALSE)","v":"S"}]
["00901",{"$f":"VLOOKUP(A130,[2]Ledenlijst!$B$2:$N$707,2,FALSE)","v":"VANDENBROUCKE Christel"},{"$f":"VLOOKUP(A130,[2]Ledenlijst!$B$2:$N$707,13,FALSE)","v":"OBA"},null,null,{"$f":"VLOOKUP(A130,[2]Ledenlijst!$B$2:$N$707,7,FALSE)","v":"K"}]
[4277,{"$f":"VLOOKUP(A131,[2]Ledenlijst!$B$2:$N$707,2,FALSE)","v":"VANDENBROUCKE Joel"},{"$f":"VLOOKUP(A131,[2]Ledenlijst!$B$2:$N$707,13,FALSE)","v":"OBA"},{"$f":"VLOOKUP(A131,[2]Ledenlijst!$B$2:$N$707,7,FALSE)","v":"S"}]
[7681,{"$f":"VLOOKUP(A132,[2]Ledenlijst!$B$2:$N$707,2,FALSE)","v":"VAN DE VELDE Jozef"},{"$f":"VLOOKUP(A132,[2]Ledenlijst!$B$2:$N$707,13,FALSE)","v":"OBA"},{"$f":"VLOOKUP(A132,[2]Ledenlijst!$B$2:$N$707,7,FALSE)","v":"S"}]
["00873",{"$f":"VLOOKUP(A133,[2]Ledenlijst!$B$2:$N$707,2,FALSE)","v":"VAN DE WYNCKEL Gustaaf"},{"$f":"VLOOKUP(A133,[2]Ledenlijst!$B$2:$N$707,13,FALSE)","v":"OBA"},null,null,{"$f":"VLOOKUP(A133,[2]Ledenlijst!$B$2:$N$707,7,FALSE)","v":"K"}]
[4274,{"$f":"VLOOKUP(A134,[2]Ledenlijst!$B$2:$N$707,2,FALSE)","v":"VAN HESTE Jean Pierre"},{"$f":"VLOOKUP(A134,[2]Ledenlijst!$B$2:$N$707,13,FALSE)","v":"OBA"},{"$f":"VLOOKUP(A134,[2]Ledenlijst!$B$2:$N$707,7,FALSE)","v":"S"}]
["00875",{"$f":"VLOOKUP(A135,[2]Ledenlijst!$B$2:$N$707,2,FALSE)","v":"VANNEUVILLE Gilberte"},{"$f":"VLOOKUP(A135,[2]Ledenlijst!$B$2:$N$707,13,FALSE)","v":"OBA"},null,null,{"$f":"VLOOKUP(A135,[2]Ledenlijst!$B$2:$N$707,7,FALSE)","v":"K"}]
["9514",{"$f":"VLOOKUP(A136,[2]Ledenlijst!$B$2:$N$707,2,FALSE)","v":"VANROOSE Matteo"},{"$f":"VLOOKUP(A136,[2]Ledenlijst!$B$2:$N$707,13,FALSE)","v":"OBA"},null,"J"]
[4276,{"$f":"VLOOKUP(A137,[2]Ledenlijst!$B$2:$N$707,2,FALSE)","v":"VAN WESEMAEL Walter"},{"$f":"VLOOKUP(A137,[2]Ledenlijst!$B$2:$N$707,13,FALSE)","v":"OBA"},{"$f":"VLOOKUP(A137,[2]Ledenlijst!$B$2:$N$707,7,FALSE)","v":"S"}]
[4207,{"$f":"VLOOKUP(A138,[2]Ledenlijst!$B$2:$N$707,2,FALSE)","v":"VELGHE Stefaan"},{"$f":"VLOOKUP(A138,[2]Ledenlijst!$B$2:$N$707,13,FALSE)","v":"OBA"},{"$f":"VLOOKUP(A138,[2]Ledenlijst!$B$2:$N$707,7,FALSE)","v":"S"}]
[1554,{"$f":"VLOOKUP(A139,[2]Ledenlijst!$B$2:$N$707,2,FALSE)","v":"VERLAECKE Rudy"},{"$f":"VLOOKUP(A139,[2]Ledenlijst!$B$2:$N$707,13,FALSE)","v":"OBA"},{"$f":"VLOOKUP(A139,[2]Ledenlijst!$B$2:$N$707,7,FALSE)","v":"S"}]
["00905",{"$f":"VLOOKUP(A140,[2]Ledenlijst!$B$2:$N$707,2,FALSE)","v":"VERSCHUERE Chanel"},{"$f":"VLOOKUP(A140,[2]Ledenlijst!$B$2:$N$707,13,FALSE)","v":"OBA"},null,null,{"$f":"VLOOKUP(A140,[2]Ledenlijst!$B$2:$N$707,7,FALSE)","v":"K"}]
[7800,{"$f":"VLOOKUP(A141,[2]Ledenlijst!$B$2:$N$707,2,FALSE)","v":"VERSCHUERE Guy"},{"$f":"VLOOKUP(A141,[2]Ledenlijst!$B$2:$N$707,13,FALSE)","v":"OBA"},{"$f":"VLOOKUP(A141,[2]Ledenlijst!$B$2:$N$707,7,FALSE)","v":"S"}]
[4280,{"$f":"VLOOKUP(A142,[2]Ledenlijst!$B$2:$N$707,2,FALSE)","v":"ZONNEKEIN Henri"},{"$f":"VLOOKUP(A142,[2]Ledenlijst!$B$2:$N$707,13,FALSE)","v":"OBA"},{"$f":"VLOOKUP(A142,[2]Ledenlijst!$B$2:$N$707,7,FALSE)","v":"S"},null,null,{"$f":"COUNTA(A86:A142)","v":57},null,"OBA"]
[]
[null,null,{"$f":"COUNTA(C3:C143)","v":140},{"$f":"COUNTA(D3:D143)","v":106},{"$f":"COUNTA(E3:E143)","v":1},{"$f":"COUNTA(F3:F143)","v":33},null,{"$f":"SUM(G3:G143)","v":140},"Bgge-Zeek"]
[]
[]
["00886",{"$f":"VLOOKUP(A147,[2]Ledenlijst!$B$2:$N$707,2,FALSE)","v":"AMANT Erik"},{"$f":"VLOOKUP(A147,[2]Ledenlijst!$B$2:$N$707,13,FALSE)","v":"SMA"},null,null,{"$f":"VLOOKUP(A147,[2]Ledenlijst!$B$2:$N$707,7,FALSE)","v":"K"}]
["00863",{"$f":"VLOOKUP(A148,[2]Ledenlijst!$B$2:$N$707,2,FALSE)","v":"DE SMET Marc"},{"$f":"VLOOKUP(A148,[2]Ledenlijst!$B$2:$N$707,13,FALSE)","v":"SMA"},null,null,{"$f":"VLOOKUP(A148,[2]Ledenlijst!$B$2:$N$707,7,FALSE)","v":"K"}]
[4294,{"$f":"VLOOKUP(A149,[2]Ledenlijst!$B$2:$N$707,2,FALSE)","v":"MATTENS Roger"},{"$f":"VLOOKUP(A149,[2]Ledenlijst!$B$2:$N$707,13,FALSE)","v":"SMA"},{"$f":"VLOOKUP(A149,[2]Ledenlijst!$B$2:$N$707,7,FALSE)","v":"S"}]
["00468",{"$f":"VLOOKUP(A150,[2]Ledenlijst!$B$2:$N$707,2,FALSE)","v":"MEERT Luc"},{"$f":"VLOOKUP(A150,[2]Ledenlijst!$B$2:$N$707,13,FALSE)","v":"SMA"},null,null,{"$f":"VLOOKUP(A150,[2]Ledenlijst!$B$2:$N$707,7,FALSE)","v":"K"}]
[7297,{"$f":"VLOOKUP(A151,[2]Ledenlijst!$B$2:$N$707,2,FALSE)","v":"MESKENS Eduard"},{"$f":"VLOOKUP(A151,[2]Ledenlijst!$B$2:$N$707,13,FALSE)","v":"SMA"},{"$f":"VLOOKUP(A151,[2]Ledenlijst!$B$2:$N$707,7,FALSE)","v":"S"}]
["00885",{"$f":"VLOOKUP(A152,[2]Ledenlijst!$B$2:$N$707,2,FALSE)","v":"PUTTEMAN François"},{"$f":"VLOOKUP(A152,[2]Ledenlijst!$B$2:$N$707,13,FALSE)","v":"SMA"},null,null,{"$f":"VLOOKUP(A152,[2]Ledenlijst!$B$2:$N$707,7,FALSE)","v":"K"}]
[9416,{"$f":"VLOOKUP(A153,[2]Ledenlijst!$B$2:$N$707,2,FALSE)","v":"RIEMKENS Wilfried"},{"$f":"VLOOKUP(A153,[2]Ledenlijst!$B$2:$N$707,13,FALSE)","v":"SMA"},{"$f":"VLOOKUP(A153,[2]Ledenlijst!$B$2:$N$707,7,FALSE)","v":"S"}]
[9417,{"$f":"VLOOKUP(A154,[2]Ledenlijst!$B$2:$N$707,2,FALSE)","v":"ROGIERS Marc"},{"$f":"VLOOKUP(A154,[2]Ledenlijst!$B$2:$N$707,13,FALSE)","v":"SMA"},{"$f":"VLOOKUP(A154,[2]Ledenlijst!$B$2:$N$707,7,FALSE)","v":"S"}]
[7048,{"$f":"VLOOKUP(A155,[2]Ledenlijst!$B$2:$N$707,2,FALSE)","v":"STILTEN Rik"},{"$f":"VLOOKUP(A155,[2]Ledenlijst!$B$2:$N$707,13,FALSE)","v":"SMA"},{"$f":"VLOOKUP(A155,[2]Ledenlijst!$B$2:$N$707,7,FALSE)","v":"S"}]
[1170,{"$f":"VLOOKUP(A156,[2]Ledenlijst!$B$2:$N$707,2,FALSE)","v":"TEMMERMAN,Dirk"},{"$f":"VLOOKUP(A156,[2]Ledenlijst!$B$2:$N$707,13,FALSE)","v":"SMA"},{"$f":"VLOOKUP(A156,[2]Ledenlijst!$B$2:$N$707,7,FALSE)","v":"S"}]
["KKSM1",{"$f":"VLOOKUP(A157,[2]Ledenlijst!$B$2:$N$707,2,FALSE)","v":"VAN DEN BERGHE Damiaan"},{"$f":"VLOOKUP(A157,[2]Ledenlijst!$B$2:$N$707,13,FALSE)","v":"SMA"},null,null,{"$f":"VLOOKUP(A157,[2]Ledenlijst!$B$2:$N$707,7,FALSE)","v":"K"}]
["KKSM2",{"$f":"VLOOKUP(A158,[2]Ledenlijst!$B$2:$N$707,2,FALSE)","v":"VAN DEN BOSSCHE Cesar"},{"$f":"VLOOKUP(A158,[2]Ledenlijst!$B$2:$N$707,13,FALSE)","v":"SMA"},null,null,{"$f":"VLOOKUP(A158,[2]Ledenlijst!$B$2:$N$707,7,FALSE)","v":"K"}]
[4297,{"$f":"VLOOKUP(A159,[2]Ledenlijst!$B$2:$N$707,2,FALSE)","v":"VAN DEN BOSSCHE Christian"},{"$f":"VLOOKUP(A159,[2]Ledenlijst!$B$2:$N$707,13,FALSE)","v":"SMA"},{"$f":"VLOOKUP(A159,[2]Ledenlijst!$B$2:$N$707,7,FALSE)","v":"S"}]
[4974,{"$f":"VLOOKUP(A160,[2]Ledenlijst!$B$2:$N$707,2,FALSE)","v":"VAN DEN BROECK Harry"},{"$f":"VLOOKUP(A160,[2]Ledenlijst!$B$2:$N$707,13,FALSE)","v":"SMA"},{"$f":"VLOOKUP(A160,[2]Ledenlijst!$B$2:$N$707,7,FALSE)","v":"S"}]
[9972,{"$f":"VLOOKUP(A161,[2]Ledenlijst!$B$2:$N$707,2,FALSE)","v":"VAN DE VONDEL Dirk"},{"$f":"VLOOKUP(A161,[2]Ledenlijst!$B$2:$N$707,13,FALSE)","v":"SMA"},{"$f":"VLOOKUP(A161,[2]Ledenlijst!$B$2:$N$707,7,FALSE)","v":"S"}]
[4301,{"$f":"VLOOKUP(A162,[2]Ledenlijst!$B$2:$N$707,2,FALSE)","v":"VAN GOETHEM Glenn"},{"$f":"VLOOKUP(A162,[2]Ledenlijst!$B$2:$N$707,13,FALSE)","v":"SMA"},{"$f":"VLOOKUP(A162,[2]Ledenlijst!$B$2:$N$707,7,FALSE)","v":"S"}]
[9415,{"$f":"VLOOKUP(A163,[2]Ledenlijst!$B$2:$N$707,2,FALSE)","v":"VERHOEYEN Eddy"},{"$f":"VLOOKUP(A163,[2]Ledenlijst!$B$2:$N$707,13,FALSE)","v":"SMA"},{"$f":"VLOOKUP(A163,[2]Ledenlijst!$B$2:$N$707,7,FALSE)","v":"S"}]
[9973,{"$f":"VLOOKUP(A164,[2]Ledenlijst!$B$2:$N$707,2,FALSE)","v":"VERHULST Jean-Paul"},{"$f":"VLOOKUP(A164,[2]Ledenlijst!$B$2:$N$707,13,FALSE)","v":"SMA"},{"$f":"VLOOKUP(A164,[2]Ledenlijst!$B$2:$N$707,7,FALSE)","v":"S"}]
[6694,{"$f":"VLOOKUP(A165,[2]Ledenlijst!$B$2:$N$707,2,FALSE)","v":"VINCK Eddie"},{"$f":"VLOOKUP(A165,[2]Ledenlijst!$B$2:$N$707,13,FALSE)","v":"SMA"},{"$f":"VLOOKUP(A165,[2]Ledenlijst!$B$2:$N$707,7,FALSE)","v":"S"},null,null,{"$f":"COUNTA(A147:A165)","v":19},null,"SMA"]
[9515,{"$f":"VLOOKUP(A166,[2]Ledenlijst!$B$2:$N$707,2,FALSE)","v":"CEULEMANS Benny"},{"$f":"VLOOKUP(A166,[2]Ledenlijst!$B$2:$N$707,13,FALSE)","v":"STER"},{"$f":"VLOOKUP(A166,[2]Ledenlijst!$B$2:$N$707,7,FALSE)","v":"S"}]
[4282,{"$f":"VLOOKUP(A167,[2]Ledenlijst!$B$2:$N$707,2,FALSE)","v":"COPPENS Sandro"},{"$f":"VLOOKUP(A167,[2]Ledenlijst!$B$2:$N$707,13,FALSE)","v":"STER"},{"$f":"VLOOKUP(A167,[2]Ledenlijst!$B$2:$N$707,7,FALSE)","v":"S"}]
[9063,{"$f":"VLOOKUP(A168,[2]Ledenlijst!$B$2:$N$707,2,FALSE)","v":"DE BECK Clery"},{"$f":"VLOOKUP(A168,[2]Ledenlijst!$B$2:$N$707,13,FALSE)","v":"STER"},{"$f":"VLOOKUP(A168,[2]Ledenlijst!$B$2:$N$707,7,FALSE)","v":"S"}]
[7804,{"$f":"VLOOKUP(A169,[2]Ledenlijst!$B$2:$N$707,2,FALSE)","v":"DE BREMAEKER Eric"},{"$f":"VLOOKUP(A169,[2]Ledenlijst!$B$2:$N$707,13,FALSE)","v":"STER"},{"$f":"VLOOKUP(A169,[2]Ledenlijst!$B$2:$N$707,7,FALSE)","v":"S"}]
["00869",{"$f":"VLOOKUP(A170,[2]Ledenlijst!$B$2:$N$707,2,FALSE)","v":"DE COSTER Luc"},{"$f":"VLOOKUP(A170,[2]Ledenlijst!$B$2:$N$707,13,FALSE)","v":"STER"},null,null,{"$f":"VLOOKUP(A170,[2]Ledenlijst!$B$2:$N$707,7,FALSE)","v":"K"}]
[9974,{"$f":"VLOOKUP(A171,[2]Ledenlijst!$B$2:$N$707,2,FALSE)","v":"DE FREYN Jasper"},{"$f":"VLOOKUP(A171,[2]Ledenlijst!$B$2:$N$707,13,FALSE)","v":"STER"},{"$f":"VLOOKUP(A171,[2]Ledenlijst!$B$2:$N$707,7,FALSE)","v":"S"}]
[7049,{"$f":"VLOOKUP(A172,[2]Ledenlijst!$B$2:$N$707,2,FALSE)","v":"DE TANT Freddy"},{"$f":"VLOOKUP(A172,[2]Ledenlijst!$B$2:$N$707,13,FALSE)","v":"STER"},{"$f":"VLOOKUP(A172,[2]Ledenlijst!$B$2:$N$707,7,FALSE)","v":"S"}]
[4344,{"$f":"VLOOKUP(A173,[2]Ledenlijst!$B$2:$N$707,2,FALSE)","v":"DE WEVER Koen"},{"$f":"VLOOKUP(A173,[2]Ledenlijst!$B$2:$N$707,13,FALSE)","v":"STER"},{"$f":"VLOOKUP(A173,[2]Ledenlijst!$B$2:$N$707,7,FALSE)","v":"S"}]
[8535,{"$f":"VLOOKUP(A174,[2]Ledenlijst!$B$2:$N$707,2,FALSE)","v":"DE WIN Guy"},{"$f":"VLOOKUP(A174,[2]Ledenlijst!$B$2:$N$707,13,FALSE)","v":"STER"},{"$f":"VLOOKUP(A174,[2]Ledenlijst!$B$2:$N$707,7,FALSE)","v":"S"}]
[9516,{"$f":"VLOOKUP(A175,[2]Ledenlijst!$B$2:$N$707,2,FALSE)","v":"DUJARDIN Geoffrey"},{"$f":"VLOOKUP(A175,[2]Ledenlijst!$B$2:$N$707,13,FALSE)","v":"STER"},{"$f":"VLOOKUP(A175,[2]Ledenlijst!$B$2:$N$707,7,FALSE)","v":"S"}]
[9517,{"$f":"VLOOKUP(A176,[2]Ledenlijst!$B$2:$N$707,2,FALSE)","v":"GOORDEN Willy"},{"$f":"VLOOKUP(A176,[2]Ledenlijst!$B$2:$N$707,13,FALSE)","v":"STER"},{"$f":"VLOOKUP(A176,[2]Ledenlijst!$B$2:$N$707,7,FALSE)","v":"S"}]
[7054,{"$f":"VLOOKUP(A177,[2]Ledenlijst!$B$2:$N$707,2,FALSE)","v":"LOOS Leo"},{"$f":"VLOOKUP(A177,[2]Ledenlijst!$B$2:$N$707,13,FALSE)","v":"STER"},{"$f":"VLOOKUP(A177,[2]Ledenlijst!$B$2:$N$707,7,FALSE)","v":"S"}]
[4345,{"$f":"VLOOKUP(A178,[2]Ledenlijst!$B$2:$N$707,2,FALSE)","v":"PARDAENS Willy"},{"$f":"VLOOKUP(A178,[2]Ledenlijst!$B$2:$N$707,13,FALSE)","v":"STER"},{"$f":"VLOOKUP(A178,[2]Ledenlijst!$B$2:$N$707,7,FALSE)","v":"S"}]
[6088,{"$f":"VLOOKUP(A179,[2]Ledenlijst!$B$2:$N$707,2,FALSE)","v":"SIROYT Davy"},{"$f":"VLOOKUP(A179,[2]Ledenlijst!$B$2:$N$707,13,FALSE)","v":"STER"},{"$f":"VLOOKUP(A179,[2]Ledenlijst!$B$2:$N$707,7,FALSE)","v":"S"}]
["4301B",{"$f":"VLOOKUP(A180,[2]Ledenlijst!$B$2:$N$707,2,FALSE)","v":"VAN GOETHEM Glenn"},{"$f":"VLOOKUP(A180,[2]Ledenlijst!$B$2:$N$707,13,FALSE)","v":"STER"},{"$f":"VLOOKUP(A180,[2]Ledenlijst!$B$2:$N$707,7,FALSE)","v":"S"}]
[5198,{"$f":"VLOOKUP(A181,[2]Ledenlijst!$B$2:$N$707,2,FALSE)","v":"VAN LAETHEM Rudi"},{"$f":"VLOOKUP(A181,[2]Ledenlijst!$B$2:$N$707,13,FALSE)","v":"STER"},{"$f":"VLOOKUP(A181,[2]Ledenlijst!$B$2:$N$707,7,FALSE)","v":"S"}]
[4320,{"$f":"VLOOKUP(A182,[2]Ledenlijst!$B$2:$N$707,2,FALSE)","v":"VAN LANGENHOVE Alain"},{"$f":"VLOOKUP(A182,[2]Ledenlijst!$B$2:$N$707,13,FALSE)","v":"STER"},{"$f":"VLOOKUP(A182,[2]Ledenlijst!$B$2:$N$707,7,FALSE)","v":"S"}]
[9458,{"$f":"VLOOKUP(A183,[2]Ledenlijst!$B$2:$N$707,2,FALSE)","v":"VANDECAN Florian"},{"$f":"VLOOKUP(A183,[2]Ledenlijst!$B$2:$N$707,13,FALSE)","v":"STER"},null,{"$f":"VLOOKUP(A183,[2]Ledenlijst!$B$2:$N$707,7,FALSE)","v":"J"}]
[2338,{"$f":"VLOOKUP(A184,[2]Ledenlijst!$B$2:$N$707,2,FALSE)","v":"VANDECAN Thierry"},{"$f":"VLOOKUP(A184,[2]Ledenlijst!$B$2:$N$707,13,FALSE)","v":"STER"},{"$f":"VLOOKUP(A184,[2]Ledenlijst!$B$2:$N$707,7,FALSE)","v":"S"}]
[4348,{"$f":"VLOOKUP(A185,[2]Ledenlijst!$B$2:$N$707,2,FALSE)","v":"VAN MUYLEM Norbert"},{"$f":"VLOOKUP(A185,[2]Ledenlijst!$B$2:$N$707,13,FALSE)","v":"STER"},{"$f":"VLOOKUP(A185,[2]Ledenlijst!$B$2:$N$707,7,FALSE)","v":"S"}]
[8017,{"$f":"VLOOKUP(A186,[2]Ledenlijst!$B$2:$N$707,2,FALSE)","v":"VAN RIET Kris"},{"$f":"VLOOKUP(A186,[2]Ledenlijst!$B$2:$N$707,13,FALSE)","v":"STER"},{"$f":"VLOOKUP(A186,[2]Ledenlijst!$B$2:$N$707,7,FALSE)","v":"S"}]
[6454,{"$f":"VLOOKUP(A187,[2]Ledenlijst!$B$2:$N$707,2,FALSE)","v":"VERCAMMEN Alwin"},{"$f":"VLOOKUP(A187,[2]Ledenlijst!$B$2:$N$707,13,FALSE)","v":"STER"},{"$f":"VLOOKUP(A187,[2]Ledenlijst!$B$2:$N$707,7,FALSE)","v":"S"}]
[4352,{"$f":"VLOOKUP(A188,[2]Ledenlijst!$B$2:$N$707,2,FALSE)","v":"WAUTERS Johnny"},{"$f":"VLOOKUP(A188,[2]Ledenlijst!$B$2:$N$707,13,FALSE)","v":"STER"},{"$f":"VLOOKUP(A188,[2]Ledenlijst!$B$2:$N$707,7,FALSE)","v":"S"},null,null,{"$f":"COUNTA(A166:A188)","v":23},null,"STER"]
[9283,{"$f":"VLOOKUP(A189,[2]Ledenlijst!$B$2:$N$707,2,FALSE)","v":"BRENDERS Thierry"},{"$f":"VLOOKUP(A189,[2]Ledenlijst!$B$2:$N$707,13,FALSE)","v":"K.OH"},{"$f":"VLOOKUP(A189,[2]Ledenlijst!$B$2:$N$707,7,FALSE)","v":"S"}]
[4354,{"$f":"VLOOKUP(A190,[2]Ledenlijst!$B$2:$N$707,2,FALSE)","v":"CAPIAU Lucien"},{"$f":"VLOOKUP(A190,[2]Ledenlijst!$B$2:$N$707,13,FALSE)","v":"K.OH"},{"$f":"VLOOKUP(A190,[2]Ledenlijst!$B$2:$N$707,7,FALSE)","v":"S"}]
["00652",{"$f":"VLOOKUP(A191,[2]Ledenlijst!$B$2:$N$707,2,FALSE)","v":"DE BOU Pol"},{"$f":"VLOOKUP(A191,[2]Ledenlijst!$B$2:$N$707,13,FALSE)","v":"K.OH"},null,null,{"$f":"VLOOKUP(A191,[2]Ledenlijst!$B$2:$N$707,7,FALSE)","v":"K"}]
[9055,{"$f":"VLOOKUP(A192,[2]Ledenlijst!$B$2:$N$707,2,FALSE)","v":"DE HERTOG Gert-Jan"},{"$f":"VLOOKUP(A192,[2]Ledenlijst!$B$2:$N$707,13,FALSE)","v":"K.OH"},{"$f":"VLOOKUP(A192,[2]Ledenlijst!$B$2:$N$707,7,FALSE)","v":"S"}]
[4305,{"$f":"VLOOKUP(A193,[2]Ledenlijst!$B$2:$N$707,2,FALSE)","v":"DE HERTOG Ives"},{"$f":"VLOOKUP(A193,[2]Ledenlijst!$B$2:$N$707,13,FALSE)","v":"K.OH"},{"$f":"VLOOKUP(A193,[2]Ledenlijst!$B$2:$N$707,7,FALSE)","v":"S"}]
[9518,{"$f":"VLOOKUP(A194,[2]Ledenlijst!$B$2:$N$707,2,FALSE)","v":"DE MECHELEER Michel"},{"$f":"VLOOKUP(A194,[2]Ledenlijst!$B$2:$N$707,13,FALSE)","v":"K.OH"},{"$f":"VLOOKUP(A194,[2]Ledenlijst!$B$2:$N$707,7,FALSE)","v":"S"}]
[4378,{"$f":"VLOOKUP(A195,[2]Ledenlijst!$B$2:$N$707,2,FALSE)","v":"DERUYVER Stefaan"},{"$f":"VLOOKUP(A195,[2]Ledenlijst!$B$2:$N$707,13,FALSE)","v":"K.OH"},{"$f":"VLOOKUP(A195,[2]Ledenlijst!$B$2:$N$707,7,FALSE)","v":"S"}]
[9064,{"$f":"VLOOKUP(A196,[2]Ledenlijst!$B$2:$N$707,2,FALSE)","v":"GERSOULLE Marc"},{"$f":"VLOOKUP(A196,[2]Ledenlijst!$B$2:$N$707,13,FALSE)","v":"K.OH"},{"$f":"VLOOKUP(A196,[2]Ledenlijst!$B$2:$N$707,7,FALSE)","v":"S"}]
[4290,{"$f":"VLOOKUP(A197,[2]Ledenlijst!$B$2:$N$707,2,FALSE)","v":"GILLADE Luc"},{"$f":"VLOOKUP(A197,[2]Ledenlijst!$B$2:$N$707,13,FALSE)","v":"K.OH"},{"$f":"VLOOKUP(A197,[2]Ledenlijst!$B$2:$N$707,7,FALSE)","v":"S"}]
[4361,{"$f":"VLOOKUP(A198,[2]Ledenlijst!$B$2:$N$707,2,FALSE)","v":"MANGELINCKX Nico"},{"$f":"VLOOKUP(A198,[2]Ledenlijst!$B$2:$N$707,13,FALSE)","v":"K.OH"},{"$f":"VLOOKUP(A198,[2]Ledenlijst!$B$2:$N$707,7,FALSE)","v":"S"}]
[8093,{"$f":"VLOOKUP(A199,[2]Ledenlijst!$B$2:$N$707,2,FALSE)","v":"MATTHYS Karolien"},{"$f":"VLOOKUP(A199,[2]Ledenlijst!$B$2:$N$707,13,FALSE)","v":"K.OH"},{"$f":"VLOOKUP(A199,[2]Ledenlijst!$B$2:$N$707,7,FALSE)","v":"S"}]
[2061,{"$f":"VLOOKUP(A200,[2]Ledenlijst!$B$2:$N$707,2,FALSE)","v":"MERTENS Eddy"},{"$f":"VLOOKUP(A200,[2]Ledenlijst!$B$2:$N$707,13,FALSE)","v":"K.OH"},{"$f":"VLOOKUP(A200,[2]Ledenlijst!$B$2:$N$707,7,FALSE)","v":"S"}]
[4387,{"$f":"VLOOKUP(A201,[2]Ledenlijst!$B$2:$N$707,2,FALSE)","v":"TEMMERMAN Walter"},{"$f":"VLOOKUP(A201,[2]Ledenlijst!$B$2:$N$707,13,FALSE)","v":"K.OH"},{"$f":"VLOOKUP(A201,[2]Ledenlijst!$B$2:$N$707,7,FALSE)","v":"S"}]
[8871,{"$f":"VLOOKUP(A202,[2]Ledenlijst!$B$2:$N$707,2,FALSE)","v":"VANDENHENDE John"},{"$f":"VLOOKUP(A202,[2]Ledenlijst!$B$2:$N$707,13,FALSE)","v":"K.OH"},{"$f":"VLOOKUP(A202,[2]Ledenlijst!$B$2:$N$707,7,FALSE)","v":"S"}]
[8066,{"$f":"VLOOKUP(A203,[2]Ledenlijst!$B$2:$N$707,2,FALSE)","v":"VANDERHAUWAERT Christian"},{"$f":"VLOOKUP(A203,[2]Ledenlijst!$B$2:$N$707,13,FALSE)","v":"K.OH"},{"$f":"VLOOKUP(A203,[2]Ledenlijst!$B$2:$N$707,7,FALSE)","v":"S"}]
[8662,{"$f":"VLOOKUP(A204,[2]Ledenlijst!$B$2:$N$707,2,FALSE)","v":"VAN DER LINDEN Eric"},{"$f":"VLOOKUP(A204,[2]Ledenlijst!$B$2:$N$707,13,FALSE)","v":"K.OH"},{"$f":"VLOOKUP(A204,[2]Ledenlijst!$B$2:$N$707,7,FALSE)","v":"S"}]
[4389,{"$f":"VLOOKUP(A205,[2]Ledenlijst!$B$2:$N$707,2,FALSE)","v":"VAN KERCKHOVE Andre"},{"$f":"VLOOKUP(A205,[2]Ledenlijst!$B$2:$N$707,13,FALSE)","v":"K.OH"},{"$f":"VLOOKUP(A205,[2]Ledenlijst!$B$2:$N$707,7,FALSE)","v":"S"}]
[4390,{"$f":"VLOOKUP(A206,[2]Ledenlijst!$B$2:$N$707,2,FALSE)","v":"VAN MALDER Dirk"},{"$f":"VLOOKUP(A206,[2]Ledenlijst!$B$2:$N$707,13,FALSE)","v":"K.OH"},{"$f":"VLOOKUP(A206,[2]Ledenlijst!$B$2:$N$707,7,FALSE)","v":"S"},null,null,{"$f":"COUNTA(A189:A206)","v":18},null,"K.OH"]
[]
[null,null,{"$f":"COUNTA(C147:C207)","v":60},{"$f":"COUNTA(D147:D207)","v":51},{"$f":"COUNTA(E147:E207)","v":1},{"$f":"COUNTA(F147:F207)","v":8},null,{"$f":"SUM(G147:G206)","v":60},"Dender"]
[]
[]
["9221C",{"$f":"VLOOKUP(A211,[2]Ledenlijst!$B$2:$N$707,2,FALSE)","v":"BOSTOEN Kris"},{"$f":"VLOOKUP(A211,[2]Ledenlijst!$B$2:$N$707,13,FALSE)","v":"ED"},{"$f":"VLOOKUP(A211,[2]Ledenlijst!$B$2:$N$707,7,FALSE)","v":"S"}]
[9420,{"$f":"VLOOKUP(A212,[2]Ledenlijst!$B$2:$N$707,2,FALSE)","v":"CAUDRON Bjorn"},{"$f":"VLOOKUP(A212,[2]Ledenlijst!$B$2:$N$707,13,FALSE)","v":"ED"},{"$f":"VLOOKUP(A212,[2]Ledenlijst!$B$2:$N$707,7,FALSE)","v":"S"}]
[9421,{"$f":"VLOOKUP(A213,[2]Ledenlijst!$B$2:$N$707,2,FALSE)","v":"CAUDRON Danny"},{"$f":"VLOOKUP(A213,[2]Ledenlijst!$B$2:$N$707,13,FALSE)","v":"ED"},{"$f":"VLOOKUP(A213,[2]Ledenlijst!$B$2:$N$707,7,FALSE)","v":"S"}]
[4425,{"$f":"VLOOKUP(A214,[2]Ledenlijst!$B$2:$N$707,2,FALSE)","v":"GEVAERT André"},{"$f":"VLOOKUP(A214,[2]Ledenlijst!$B$2:$N$707,13,FALSE)","v":"ED"},{"$f":"VLOOKUP(A214,[2]Ledenlijst!$B$2:$N$707,7,FALSE)","v":"S"}]
[8410,{"$f":"VLOOKUP(A215,[2]Ledenlijst!$B$2:$N$707,2,FALSE)","v":"LIPPENS Tony"},{"$f":"VLOOKUP(A215,[2]Ledenlijst!$B$2:$N$707,13,FALSE)","v":"ED"},{"$f":"VLOOKUP(A215,[2]Ledenlijst!$B$2:$N$707,7,FALSE)","v":"S"}]
[9260,{"$f":"VLOOKUP(A216,[2]Ledenlijst!$B$2:$N$707,2,FALSE)","v":"VAN HEIRSEELE Roger"},{"$f":"VLOOKUP(A216,[2]Ledenlijst!$B$2:$N$707,13,FALSE)","v":"ED"},{"$f":"VLOOKUP(A216,[2]Ledenlijst!$B$2:$N$707,7,FALSE)","v":"S"},null,null,{"$f":"COUNTA(A211:A216)","v":6},null,"ED"]
[8654,{"$f":"VLOOKUP(A217,[2]Ledenlijst!$B$2:$N$707,2,FALSE)","v":"BAETSLE Peter"},{"$f":"VLOOKUP(A217,[2]Ledenlijst!$B$2:$N$707,13,FALSE)","v":"GS"},{"$f":"VLOOKUP(A217,[2]Ledenlijst!$B$2:$N$707,7,FALSE)","v":"S"}]
[4506,{"$f":"VLOOKUP(A218,[2]Ledenlijst!$B$2:$N$707,2,FALSE)","v":"BRACKE Tom"},{"$f":"VLOOKUP(A218,[2]Ledenlijst!$B$2:$N$707,13,FALSE)","v":"GS"},{"$f":"VLOOKUP(A218,[2]Ledenlijst!$B$2:$N$707,7,FALSE)","v":"S"}]
[6701,{"$f":"VLOOKUP(A219,[2]Ledenlijst!$B$2:$N$707,2,FALSE)","v":"BROCHE Philippe"},{"$f":"VLOOKUP(A219,[2]Ledenlijst!$B$2:$N$707,13,FALSE)","v":"GS"},{"$f":"VLOOKUP(A219,[2]Ledenlijst!$B$2:$N$707,7,FALSE)","v":"S"}]
[6703,{"$f":"VLOOKUP(A220,[2]Ledenlijst!$B$2:$N$707,2,FALSE)","v":"CLAUS Pascal"},{"$f":"VLOOKUP(A220,[2]Ledenlijst!$B$2:$N$707,13,FALSE)","v":"GS"},{"$f":"VLOOKUP(A220,[2]Ledenlijst!$B$2:$N$707,7,FALSE)","v":"S"}]
[1033,{"$f":"VLOOKUP(A221,[2]Ledenlijst!$B$2:$N$707,2,FALSE)","v":"DE CASTER Marc"},{"$f":"VLOOKUP(A221,[2]Ledenlijst!$B$2:$N$707,13,FALSE)","v":"GS"},{"$f":"VLOOKUP(A221,[2]Ledenlijst!$B$2:$N$707,7,FALSE)","v":"S"}]
[9959,{"$f":"VLOOKUP(A222,[2]Ledenlijst!$B$2:$N$707,2,FALSE)","v":"DEDEYNE Firmin"},{"$f":"VLOOKUP(A222,[2]Ledenlijst!$B$2:$N$707,13,FALSE)","v":"GS"},{"$f":"VLOOKUP(A222,[2]Ledenlijst!$B$2:$N$707,7,FALSE)","v":"S"}]
[8889,{"$f":"VLOOKUP(A223,[2]Ledenlijst!$B$2:$N$707,2,FALSE)","v":"DE PREST Alex"},{"$f":"VLOOKUP(A223,[2]Ledenlijst!$B$2:$N$707,13,FALSE)","v":"GS"},{"$f":"VLOOKUP(A223,[2]Ledenlijst!$B$2:$N$707,7,FALSE)","v":"S"}]
[8163,{"$f":"VLOOKUP(A224,[2]Ledenlijst!$B$2:$N$707,2,FALSE)","v":"DE WEIRDT Jean-Marie"},{"$f":"VLOOKUP(A224,[2]Ledenlijst!$B$2:$N$707,13,FALSE)","v":"GS"},{"$f":"VLOOKUP(A224,[2]Ledenlijst!$B$2:$N$707,7,FALSE)","v":"S"}]
[7203,{"$f":"VLOOKUP(A225,[2]Ledenlijst!$B$2:$N$707,2,FALSE)","v":"DELARUE Dirk"},{"$f":"VLOOKUP(A225,[2]Ledenlijst!$B$2:$N$707,13,FALSE)","v":"GS"},{"$f":"VLOOKUP(A225,[2]Ledenlijst!$B$2:$N$707,7,FALSE)","v":"S"}]
[4541,{"$f":"VLOOKUP(A226,[2]Ledenlijst!$B$2:$N$707,2,FALSE)","v":"DELLAERT Marc"},{"$f":"VLOOKUP(A226,[2]Ledenlijst!$B$2:$N$707,13,FALSE)","v":"GS"},{"$f":"VLOOKUP(A226,[2]Ledenlijst!$B$2:$N$707,7,FALSE)","v":"S"}]
[4454,{"$f":"VLOOKUP(A227,[2]Ledenlijst!$B$2:$N$707,2,FALSE)","v":"DEPOORTER Reginald"},{"$f":"VLOOKUP(A227,[2]Ledenlijst!$B$2:$N$707,13,FALSE)","v":"GS"},{"$f":"VLOOKUP(A227,[2]Ledenlijst!$B$2:$N$707,7,FALSE)","v":"S"}]
[9419,{"$f":"VLOOKUP(A228,[2]Ledenlijst!$B$2:$N$707,2,FALSE)","v":"MOEYKENS Biacio"},{"$f":"VLOOKUP(A228,[2]Ledenlijst!$B$2:$N$707,13,FALSE)","v":"GS"},{"$f":"VLOOKUP(A228,[2]Ledenlijst!$B$2:$N$707,7,FALSE)","v":"S"}]
[4466,{"$f":"VLOOKUP(A229,[2]Ledenlijst!$B$2:$N$707,2,FALSE)","v":"TREMERIE Walter"},{"$f":"VLOOKUP(A229,[2]Ledenlijst!$B$2:$N$707,13,FALSE)","v":"GS"},{"$f":"VLOOKUP(A229,[2]Ledenlijst!$B$2:$N$707,7,FALSE)","v":"S"}]
[7498,{"$f":"VLOOKUP(A230,[2]Ledenlijst!$B$2:$N$707,2,FALSE)","v":"VAN DAM Jens"},{"$f":"VLOOKUP(A230,[2]Ledenlijst!$B$2:$N$707,13,FALSE)","v":"GS"},{"$f":"VLOOKUP(A230,[2]Ledenlijst!$B$2:$N$707,7,FALSE)","v":"S"}]
[8890,{"$f":"VLOOKUP(A231,[2]Ledenlijst!$B$2:$N$707,2,FALSE)","v":"VAN HOLLE Jean-Pierre"},{"$f":"VLOOKUP(A231,[2]Ledenlijst!$B$2:$N$707,13,FALSE)","v":"GS"},{"$f":"VLOOKUP(A231,[2]Ledenlijst!$B$2:$N$707,7,FALSE)","v":"S"}]
[4587,{"$f":"VLOOKUP(A232,[2]Ledenlijst!$B$2:$N$707,2,FALSE)","v":"VERSTRAETEN Frank"},{"$f":"VLOOKUP(A232,[2]Ledenlijst!$B$2:$N$707,13,FALSE)","v":"GS"},{"$f":"VLOOKUP(A232,[2]Ledenlijst!$B$2:$N$707,7,FALSE)","v":"S"}]
[1039,{"$f":"VLOOKUP(A233,[2]Ledenlijst!$B$2:$N$707,2,FALSE)","v":"WIEME Koenraad"},{"$f":"VLOOKUP(A233,[2]Ledenlijst!$B$2:$N$707,13,FALSE)","v":"GS"},{"$f":"VLOOKUP(A233,[2]Ledenlijst!$B$2:$N$707,7,FALSE)","v":"S"},null,null,{"$f":"COUNTA(A217:A233)","v":17},null,"GS"]
[7806,{"$f":"VLOOKUP(A234,[2]Ledenlijst!$B$2:$N$707,2,FALSE)","v":"BAUTE Steven"},{"$f":"VLOOKUP(A234,[2]Ledenlijst!$B$2:$N$707,13,FALSE)","v":"EWH"},{"$f":"VLOOKUP(A234,[2]Ledenlijst!$B$2:$N$707,7,FALSE)","v":"S"}]
[1071,{"$f":"VLOOKUP(A235,[2]Ledenlijst!$B$2:$N$707,2,FALSE)","v":"BILLIET Jelle"},{"$f":"VLOOKUP(A235,[2]Ledenlijst!$B$2:$N$707,13,FALSE)","v":"EWH"},null,{"$f":"VLOOKUP(A235,[2]Ledenlijst!$B$2:$N$707,7,FALSE)","v":"J"}]
[9966,{"$f":"VLOOKUP(A236,[2]Ledenlijst!$B$2:$N$707,2,FALSE)","v":"BRUGGEMAN Etienne"},{"$f":"VLOOKUP(A236,[2]Ledenlijst!$B$2:$N$707,13,FALSE)","v":"EWH"},{"$f":"VLOOKUP(A236,[2]Ledenlijst!$B$2:$N$707,7,FALSE)","v":"S"}]
["KKEW1",{"$f":"VLOOKUP(A237,[2]Ledenlijst!$B$2:$N$707,2,FALSE)","v":"CAUDRON Bjorn"},{"$f":"VLOOKUP(A237,[2]Ledenlijst!$B$2:$N$707,13,FALSE)","v":"EWH"},null,null,{"$f":"VLOOKUP(A237,[2]Ledenlijst!$B$2:$N$707,7,FALSE)","v":"K"}]
["KKEW2",{"$f":"VLOOKUP(A238,[2]Ledenlijst!$B$2:$N$707,2,FALSE)","v":"CAUDRON Danny"},{"$f":"VLOOKUP(A238,[2]Ledenlijst!$B$2:$N$707,13,FALSE)","v":"EWH"},null,null,{"$f":"VLOOKUP(A238,[2]Ledenlijst!$B$2:$N$707,7,FALSE)","v":"K"}]
[8063,{"$f":"VLOOKUP(A239,[2]Ledenlijst!$B$2:$N$707,2,FALSE)","v":"COPPENS Christiaan"},{"$f":"VLOOKUP(A239,[2]Ledenlijst!$B$2:$N$707,13,FALSE)","v":"EWH"},{"$f":"VLOOKUP(A239,[2]Ledenlijst!$B$2:$N$707,7,FALSE)","v":"S"}]
[4472,{"$f":"VLOOKUP(A240,[2]Ledenlijst!$B$2:$N$707,2,FALSE)","v":"DE BAETS Danny"},{"$f":"VLOOKUP(A240,[2]Ledenlijst!$B$2:$N$707,13,FALSE)","v":"EWH"},{"$f":"VLOOKUP(A240,[2]Ledenlijst!$B$2:$N$707,7,FALSE)","v":"S"}]
[9592,{"$f":"VLOOKUP(A241,[2]Ledenlijst!$B$2:$N$707,2,FALSE)","v":"DE LOBEL Marc"},{"$f":"VLOOKUP(A241,[2]Ledenlijst!$B$2:$N$707,13,FALSE)","v":"EWH"},{"$f":"VLOOKUP(A241,[2]Ledenlijst!$B$2:$N$707,7,FALSE)","v":"S"}]
["00689",{"$f":"VLOOKUP(A242,[2]Ledenlijst!$B$2:$N$707,2,FALSE)","v":"FOURNEAU Alain"},{"$f":"VLOOKUP(A242,[2]Ledenlijst!$B$2:$N$707,13,FALSE)","v":"EWH"},null,null,{"$f":"VLOOKUP(A242,[2]Ledenlijst!$B$2:$N$707,7,FALSE)","v":"K"}]
["00357",{"$f":"VLOOKUP(A243,[2]Ledenlijst!$B$2:$N$707,2,FALSE)","v":"GEVAERT André"},{"$f":"VLOOKUP(A243,[2]Ledenlijst!$B$2:$N$707,13,FALSE)","v":"EWH"},null,null,{"$f":"VLOOKUP(A243,[2]Ledenlijst!$B$2:$N$707,7,FALSE)","v":"K"}]
[8657,{"$f":"VLOOKUP(A244,[2]Ledenlijst!$B$2:$N$707,2,FALSE)","v":"HOLDERBEKE Alex"},{"$f":"VLOOKUP(A244,[2]Ledenlijst!$B$2:$N$707,13,FALSE)","v":"EWH"},{"$f":"VLOOKUP(A244,[2]Ledenlijst!$B$2:$N$707,7,FALSE)","v":"S"}]
[4550,{"$f":"VLOOKUP(A245,[2]Ledenlijst!$B$2:$N$707,2,FALSE)","v":"KESTELOOT Patrick"},{"$f":"VLOOKUP(A245,[2]Ledenlijst!$B$2:$N$707,13,FALSE)","v":"EWH"},{"$f":"VLOOKUP(A245,[2]Ledenlijst!$B$2:$N$707,7,FALSE)","v":"S"}]
[9593,{"$f":"VLOOKUP(A246,[2]Ledenlijst!$B$2:$N$707,2,FALSE)","v":"TRENSON Gabriel"},{"$f":"VLOOKUP(A246,[2]Ledenlijst!$B$2:$N$707,13,FALSE)","v":"EWH"},{"$f":"VLOOKUP(A246,[2]Ledenlijst!$B$2:$N$707,7,FALSE)","v":"S"}]
[9424,{"$f":"VLOOKUP(A247,[2]Ledenlijst!$B$2:$N$707,2,FALSE)","v":"VAN DEN EEDE Marc"},{"$f":"VLOOKUP(A247,[2]Ledenlijst!$B$2:$N$707,13,FALSE)","v":"EWH"},{"$f":"VLOOKUP(A247,[2]Ledenlijst!$B$2:$N$707,7,FALSE)","v":"S"}]
[9594,{"$f":"VLOOKUP(A248,[2]Ledenlijst!$B$2:$N$707,2,FALSE)","v":"VAN QUATHEM Romain"},{"$f":"VLOOKUP(A248,[2]Ledenlijst!$B$2:$N$707,13,FALSE)","v":"EWH"},{"$f":"VLOOKUP(A248,[2]Ledenlijst!$B$2:$N$707,7,FALSE)","v":"S"}]
[9595,{"$f":"VLOOKUP(A249,[2]Ledenlijst!$B$2:$N$707,2,FALSE)","v":"VERBEURE Danny"},{"$f":"VLOOKUP(A249,[2]Ledenlijst!$B$2:$N$707,13,FALSE)","v":"EWH"},{"$f":"VLOOKUP(A249,[2]Ledenlijst!$B$2:$N$707,7,FALSE)","v":"S"},null,null,{"$f":"COUNTA(A234:A249)","v":16},null,"EWH"]
["KKBV1",{"$f":"VLOOKUP(A250,[2]Ledenlijst!$B$2:$N$707,2,FALSE)","v":"BAETE Jean-Pierre"},{"$f":"VLOOKUP(A250,[2]Ledenlijst!$B$2:$N$707,13,FALSE)","v":"BVG"},null,null,{"$f":"VLOOKUP(A250,[2]Ledenlijst!$B$2:$N$707,7,FALSE)","v":"K"}]
[4942,{"$f":"VLOOKUP(A251,[2]Ledenlijst!$B$2:$N$707,2,FALSE)","v":"BAETENS Marc"},{"$f":"VLOOKUP(A251,[2]Ledenlijst!$B$2:$N$707,13,FALSE)","v":"BVG"},{"$f":"VLOOKUP(A251,[2]Ledenlijst!$B$2:$N$707,7,FALSE)","v":"S"}]
[6435,{"$f":"VLOOKUP(A252,[2]Ledenlijst!$B$2:$N$707,2,FALSE)","v":"BELAEY Danny"},{"$f":"VLOOKUP(A252,[2]Ledenlijst!$B$2:$N$707,13,FALSE)","v":"BVG"},{"$f":"VLOOKUP(A252,[2]Ledenlijst!$B$2:$N$707,7,FALSE)","v":"S"}]
[7476,{"$f":"VLOOKUP(A253,[2]Ledenlijst!$B$2:$N$707,2,FALSE)","v":"DE COOMAN Marcel"},{"$f":"VLOOKUP(A253,[2]Ledenlijst!$B$2:$N$707,13,FALSE)","v":"BVG"},{"$f":"VLOOKUP(A253,[2]Ledenlijst!$B$2:$N$707,7,FALSE)","v":"S"}]
[4341,{"$f":"VLOOKUP(A254,[2]Ledenlijst!$B$2:$N$707,2,FALSE)","v":"DE COSTER Luc"},{"$f":"VLOOKUP(A254,[2]Ledenlijst!$B$2:$N$707,13,FALSE)","v":"BVG"},{"$f":"VLOOKUP(A254,[2]Ledenlijst!$B$2:$N$707,7,FALSE)","v":"S"}]
[4910,{"$f":"VLOOKUP(A255,[2]Ledenlijst!$B$2:$N$707,2,FALSE)","v":"DE FLO Herman"},{"$f":"VLOOKUP(A255,[2]Ledenlijst!$B$2:$N$707,13,FALSE)","v":"BVG"},{"$f":"VLOOKUP(A255,[2]Ledenlijst!$B$2:$N$707,7,FALSE)","v":"S"}]
[9261,{"$f":"VLOOKUP(A256,[2]Ledenlijst!$B$2:$N$707,2,FALSE)","v":"DE MEULEMEESTER Cédric"},{"$f":"VLOOKUP(A256,[2]Ledenlijst!$B$2:$N$707,13,FALSE)","v":"BVG"},null,{"$f":"VLOOKUP(A256,[2]Ledenlijst!$B$2:$N$707,7,FALSE)","v":"J"}]
[1036,{"$f":"VLOOKUP(A257,[2]Ledenlijst!$B$2:$N$707,2,FALSE)","v":"DEPOORTER Mieke"},{"$f":"VLOOKUP(A257,[2]Ledenlijst!$B$2:$N$707,13,FALSE)","v":"BVG"},{"$f":"VLOOKUP(A257,[2]Ledenlijst!$B$2:$N$707,7,FALSE)","v":"S"}]
[8165,{"$f":"VLOOKUP(A258,[2]Ledenlijst!$B$2:$N$707,2,FALSE)","v":"DE RUDDER Willy"},{"$f":"VLOOKUP(A258,[2]Ledenlijst!$B$2:$N$707,13,FALSE)","v":"BVG"},{"$f":"VLOOKUP(A258,[2]Ledenlijst!$B$2:$N$707,7,FALSE)","v":"S"}]
[9426,{"$f":"VLOOKUP(A259,[2]Ledenlijst!$B$2:$N$707,2,FALSE)","v":"DE WISPELAERE Walter"},{"$f":"VLOOKUP(A259,[2]Ledenlijst!$B$2:$N$707,13,FALSE)","v":"BVG"},{"$f":"VLOOKUP(A259,[2]Ledenlijst!$B$2:$N$707,7,FALSE)","v":"S"}]
[4639,{"$f":"VLOOKUP(A260,[2]Ledenlijst!$B$2:$N$707,2,FALSE)","v":"DUPONT Franky"},{"$f":"VLOOKUP(A260,[2]Ledenlijst!$B$2:$N$707,13,FALSE)","v":"BVG"},{"$f":"VLOOKUP(A260,[2]Ledenlijst!$B$2:$N$707,7,FALSE)","v":"S"}]
["KKBV2",{"$f":"VLOOKUP(A261,[2]Ledenlijst!$B$2:$N$707,2,FALSE)","v":"GORLEER Omer"},{"$f":"VLOOKUP(A261,[2]Ledenlijst!$B$2:$N$707,13,FALSE)","v":"BVG"},null,null,{"$f":"VLOOKUP(A261,[2]Ledenlijst!$B$2:$N$707,7,FALSE)","v":"K"}]
[7685,{"$f":"VLOOKUP(A262,[2]Ledenlijst!$B$2:$N$707,2,FALSE)","v":"HANSKENS Stefaan"},{"$f":"VLOOKUP(A262,[2]Ledenlijst!$B$2:$N$707,13,FALSE)","v":"BVG"},{"$f":"VLOOKUP(A262,[2]Ledenlijst!$B$2:$N$707,7,FALSE)","v":"S"}]
[9956,{"$f":"VLOOKUP(A263,[2]Ledenlijst!$B$2:$N$707,2,FALSE)","v":"KASIER Sven"},{"$f":"VLOOKUP(A263,[2]Ledenlijst!$B$2:$N$707,13,FALSE)","v":"BVG"},{"$f":"VLOOKUP(A263,[2]Ledenlijst!$B$2:$N$707,7,FALSE)","v":"S"}]
[5747,{"$f":"VLOOKUP(A264,[2]Ledenlijst!$B$2:$N$707,2,FALSE)","v":"SAEY Etienne"},{"$f":"VLOOKUP(A264,[2]Ledenlijst!$B$2:$N$707,13,FALSE)","v":"BVG"},{"$f":"VLOOKUP(A264,[2]Ledenlijst!$B$2:$N$707,7,FALSE)","v":"S"}]
[6577,{"$f":"VLOOKUP(A265,[2]Ledenlijst!$B$2:$N$707,2,FALSE)","v":"SCIACCA Emilio"},{"$f":"VLOOKUP(A265,[2]Ledenlijst!$B$2:$N$707,13,FALSE)","v":"BVG"},{"$f":"VLOOKUP(A265,[2]Ledenlijst!$B$2:$N$707,7,FALSE)","v":"S"}]
[1040,{"$f":"VLOOKUP(A266,[2]Ledenlijst!$B$2:$N$707,2,FALSE)","v":"SERGEANT Etienne"},{"$f":"VLOOKUP(A266,[2]Ledenlijst!$B$2:$N$707,13,FALSE)","v":"BVG"},{"$f":"VLOOKUP(A266,[2]Ledenlijst!$B$2:$N$707,7,FALSE)","v":"S"}]
["4559B",{"$f":"VLOOKUP(A267,[2]Ledenlijst!$B$2:$N$707,2,FALSE)","v":"STANDAERT Arthur"},{"$f":"VLOOKUP(A267,[2]Ledenlijst!$B$2:$N$707,13,FALSE)","v":"BVG"},{"$f":"VLOOKUP(A267,[2]Ledenlijst!$B$2:$N$707,7,FALSE)","v":"S"}]
[4845,{"$f":"VLOOKUP(A268,[2]Ledenlijst!$B$2:$N$707,2,FALSE)","v":"STEVENS Patrick"},{"$f":"VLOOKUP(A268,[2]Ledenlijst!$B$2:$N$707,13,FALSE)","v":"BVG"},{"$f":"VLOOKUP(A268,[2]Ledenlijst!$B$2:$N$707,7,FALSE)","v":"S"}]
[4036,{"$f":"VLOOKUP(A269,[2]Ledenlijst!$B$2:$N$707,2,FALSE)","v":"STRIJPENS Lucien"},{"$f":"VLOOKUP(A269,[2]Ledenlijst!$B$2:$N$707,13,FALSE)","v":"BVG"},{"$f":"VLOOKUP(A269,[2]Ledenlijst!$B$2:$N$707,7,FALSE)","v":"S"}]
["00651",{"$f":"VLOOKUP(A270,[2]Ledenlijst!$B$2:$N$707,2,FALSE)","v":"VAN ACKER Jan"},{"$f":"VLOOKUP(A270,[2]Ledenlijst!$B$2:$N$707,13,FALSE)","v":"BVG"},null,null,{"$f":"VLOOKUP(A270,[2]Ledenlijst!$B$2:$N$707,7,FALSE)","v":"K"}]
[6713,{"$f":"VLOOKUP(A271,[2]Ledenlijst!$B$2:$N$707,2,FALSE)","v":"VAN ACKER Johan"},{"$f":"VLOOKUP(A271,[2]Ledenlijst!$B$2:$N$707,13,FALSE)","v":"BVG"},{"$f":"VLOOKUP(A271,[2]Ledenlijst!$B$2:$N$707,7,FALSE)","v":"S"}]
[5733,{"$f":"VLOOKUP(A272,[2]Ledenlijst!$B$2:$N$707,2,FALSE)","v":"VAN BRUYSSEL Rony"},{"$f":"VLOOKUP(A272,[2]Ledenlijst!$B$2:$N$707,13,FALSE)","v":"BVG"},{"$f":"VLOOKUP(A272,[2]Ledenlijst!$B$2:$N$707,7,FALSE)","v":"S"}]
[9427,{"$f":"VLOOKUP(A273,[2]Ledenlijst!$B$2:$N$707,2,FALSE)","v":"VANDENBERGHE Glen"},{"$f":"VLOOKUP(A273,[2]Ledenlijst!$B$2:$N$707,13,FALSE)","v":"BVG"},{"$f":"VLOOKUP(A273,[2]Ledenlijst!$B$2:$N$707,7,FALSE)","v":"S"}]
["4931",{"$f":"VLOOKUP(A274,[2]Ledenlijst!$B$2:$N$707,2,FALSE)","v":"VAN HOYLANDT Roger"},{"$f":"VLOOKUP(A274,[2]Ledenlijst!$B$2:$N$707,13,FALSE)","v":"BVG"},{"$f":"VLOOKUP(A274,[2]Ledenlijst!$B$2:$N$707,7,FALSE)","v":"S"}]
[5798,{"$f":"VLOOKUP(A275,[2]Ledenlijst!$B$2:$N$707,2,FALSE)","v":"VAN MANEN Bert"},{"$f":"VLOOKUP(A275,[2]Ledenlijst!$B$2:$N$707,13,FALSE)","v":"BVG"},{"$f":"VLOOKUP(A275,[2]Ledenlijst!$B$2:$N$707,7,FALSE)","v":"s"}]
[4932,{"$f":"VLOOKUP(A276,[2]Ledenlijst!$B$2:$N$707,2,FALSE)","v":"VAN MOL William"},{"$f":"VLOOKUP(A276,[2]Ledenlijst!$B$2:$N$707,13,FALSE)","v":"BVG"},{"$f":"VLOOKUP(A276,[2]Ledenlijst!$B$2:$N$707,7,FALSE)","v":"S"}]
[4416,{"$f":"VLOOKUP(A277,[2]Ledenlijst!$B$2:$N$707,2,FALSE)","v":"VAN RIJSSELBERGHE Johan"},{"$f":"VLOOKUP(A277,[2]Ledenlijst!$B$2:$N$707,13,FALSE)","v":"BVG"},{"$f":"VLOOKUP(A277,[2]Ledenlijst!$B$2:$N$707,7,FALSE)","v":"S"}]
[9066,{"$f":"VLOOKUP(A278,[2]Ledenlijst!$B$2:$N$707,2,FALSE)","v":"WILLEMS Raymond"},{"$f":"VLOOKUP(A278,[2]Ledenlijst!$B$2:$N$707,13,FALSE)","v":"BVG"},{"$f":"VLOOKUP(A278,[2]Ledenlijst!$B$2:$N$707,7,FALSE)","v":"S"},null,null,{"$f":"COUNTA(A250:A278)","v":29},null,"BVG"]
["LKAR1",{"$f":"VLOOKUP(A279,[2]Ledenlijst!$B$2:$N$707,2,FALSE)","v":"COOLE Gino"},{"$f":"VLOOKUP(A279,[2]Ledenlijst!$B$2:$N$707,13,FALSE)","v":"ARG"},{"$f":"VLOOKUP(A279,[2]Ledenlijst!$B$2:$N$707,7,FALSE)","v":"S"}]
[9962,{"$f":"VLOOKUP(A280,[2]Ledenlijst!$B$2:$N$707,2,FALSE)","v":"DE BRAEKELEIR Gilbert"},{"$f":"VLOOKUP(A280,[2]Ledenlijst!$B$2:$N$707,13,FALSE)","v":"ARG"},{"$f":"VLOOKUP(A280,[2]Ledenlijst!$B$2:$N$707,7,FALSE)","v":"S"}]
[7046,{"$f":"VLOOKUP(A281,[2]Ledenlijst!$B$2:$N$707,2,FALSE)","v":"DE GRAEVE Peter"},{"$f":"VLOOKUP(A281,[2]Ledenlijst!$B$2:$N$707,13,FALSE)","v":"ARG"},{"$f":"VLOOKUP(A281,[2]Ledenlijst!$B$2:$N$707,7,FALSE)","v":"S"}]
["LKAR2",{"$f":"VLOOKUP(A282,[2]Ledenlijst!$B$2:$N$707,2,FALSE)","v":"DE HAM Claire"},{"$f":"VLOOKUP(A282,[2]Ledenlijst!$B$2:$N$707,13,FALSE)","v":"ARG"},{"$f":"VLOOKUP(A282,[2]Ledenlijst!$B$2:$N$707,7,FALSE)","v":"S"}]
["KKAR2",{"$f":"VLOOKUP(A283,[2]Ledenlijst!$B$2:$N$707,2,FALSE)","v":"EGO Marc"},{"$f":"VLOOKUP(A283,[2]Ledenlijst!$B$2:$N$707,13,FALSE)","v":"ARG"},null,null,{"$f":"VLOOKUP(A283,[2]Ledenlijst!$B$2:$N$707,7,FALSE)","v":"K"}]
["KKAR3",{"$f":"VLOOKUP(A284,[2]Ledenlijst!$B$2:$N$707,2,FALSE)","v":"GORLEER Omer"},{"$f":"VLOOKUP(A284,[2]Ledenlijst!$B$2:$N$707,13,FALSE)","v":"ARG"},null,null,{"$f":"VLOOKUP(A284,[2]Ledenlijst!$B$2:$N$707,7,FALSE)","v":"K"}]
[9071,{"$f":"VLOOKUP(A285,[2]Ledenlijst!$B$2:$N$707,2,FALSE)","v":"VANDOMMELE Johan"},{"$f":"VLOOKUP(A285,[2]Ledenlijst!$B$2:$N$707,13,FALSE)","v":"ARG"},{"$f":"VLOOKUP(A285,[2]Ledenlijst!$B$2:$N$707,7,FALSE)","v":"S"},null,null,{"$f":"COUNTA(A279:A285)","v":7},null,"ARG"]
[9960,{"$f":"VLOOKUP(A286,[2]Ledenlijst!$B$2:$N$707,2,FALSE)","v":"DEVO Antoon"},{"$f":"VLOOKUP(A286,[2]Ledenlijst!$B$2:$N$707,13,FALSE)","v":"K&V"},{"$f":"VLOOKUP(A286,[2]Ledenlijst!$B$2:$N$707,7,FALSE)","v":"S"}]
[9263,{"$f":"VLOOKUP(A287,[2]Ledenlijst!$B$2:$N$707,2,FALSE)","v":"DEVOS Guido"},{"$f":"VLOOKUP(A287,[2]Ledenlijst!$B$2:$N$707,13,FALSE)","v":"K&V"},{"$f":"VLOOKUP(A287,[2]Ledenlijst!$B$2:$N$707,7,FALSE)","v":"S"}]
[9429,{"$f":"VLOOKUP(A288,[2]Ledenlijst!$B$2:$N$707,2,FALSE)","v":"HERREMAN Luc"},{"$f":"VLOOKUP(A288,[2]Ledenlijst!$B$2:$N$707,13,FALSE)","v":"K&V"},{"$f":"VLOOKUP(A288,[2]Ledenlijst!$B$2:$N$707,7,FALSE)","v":"S"}]
["KKKV1",{"$f":"VLOOKUP(A289,[2]Ledenlijst!$B$2:$N$707,2,FALSE)","v":"REYCHLER Hedwig"},{"$f":"VLOOKUP(A289,[2]Ledenlijst!$B$2:$N$707,13,FALSE)","v":"K&V"},null,null,{"$f":"VLOOKUP(A289,[2]Ledenlijst!$B$2:$N$707,7,FALSE)","v":"K"}]
[8918,{"$f":"VLOOKUP(A290,[2]Ledenlijst!$B$2:$N$707,2,FALSE)","v":"VANDENBERGHE Pascal"},{"$f":"VLOOKUP(A290,[2]Ledenlijst!$B$2:$N$707,13,FALSE)","v":"K&V"},{"$f":"VLOOKUP(A290,[2]Ledenlijst!$B$2:$N$707,7,FALSE)","v":"S"}]
[9520,{"$f":"VLOOKUP(A291,[2]Ledenlijst!$B$2:$N$707,2,FALSE)","v":"VANDERLINDEN Aimé"},{"$f":"VLOOKUP(A291,[2]Ledenlijst!$B$2:$N$707,13,FALSE)","v":"K&V"},{"$f":"VLOOKUP(A291,[2]Ledenlijst!$B$2:$N$707,7,FALSE)","v":"S"}]
[9428,{"$f":"VLOOKUP(A292,[2]Ledenlijst!$B$2:$N$707,2,FALSE)","v":"WIELFAERT Curt"},{"$f":"VLOOKUP(A292,[2]Ledenlijst!$B$2:$N$707,13,FALSE)","v":"K&V"},{"$f":"VLOOKUP(A292,[2]Ledenlijst!$B$2:$N$707,7,FALSE)","v":"S"},null,null,{"$f":"COUNTA(A286:A292)","v":7},null,"K&V"]
[8897,{"$f":"VLOOKUP(A293,[2]Ledenlijst!$B$2:$N$707,2,FALSE)","v":"BAELE Edmond"},{"$f":"VLOOKUP(A293,[2]Ledenlijst!$B$2:$N$707,13,FALSE)","v":"K.BCAW"},{"$f":"VLOOKUP(A293,[2]Ledenlijst!$B$2:$N$707,7,FALSE)","v":"S"}]
[8349,{"$f":"VLOOKUP(A294,[2]Ledenlijst!$B$2:$N$707,2,FALSE)","v":"CLAERHOUT Bernard"},{"$f":"VLOOKUP(A294,[2]Ledenlijst!$B$2:$N$707,13,FALSE)","v":"K.BCAW"},{"$f":"VLOOKUP(A294,[2]Ledenlijst!$B$2:$N$707,7,FALSE)","v":"S"}]
[8352,{"$f":"VLOOKUP(A295,[2]Ledenlijst!$B$2:$N$707,2,FALSE)","v":"COSYNS Marc"},{"$f":"VLOOKUP(A295,[2]Ledenlijst!$B$2:$N$707,13,FALSE)","v":"K.BCAW"},{"$f":"VLOOKUP(A295,[2]Ledenlijst!$B$2:$N$707,7,FALSE)","v":"S"}]
[6706,{"$f":"VLOOKUP(A296,[2]Ledenlijst!$B$2:$N$707,2,FALSE)","v":"DE FAUW Guy"},{"$f":"VLOOKUP(A296,[2]Ledenlijst!$B$2:$N$707,13,FALSE)","v":"K.BCAW"},{"$f":"VLOOKUP(A296,[2]Ledenlijst!$B$2:$N$707,7,FALSE)","v":"S"}]
[7475,{"$f":"VLOOKUP(A297,[2]Ledenlijst!$B$2:$N$707,2,FALSE)","v":"DE MOL Daniel"},{"$f":"VLOOKUP(A297,[2]Ledenlijst!$B$2:$N$707,13,FALSE)","v":"K.BCAW"},{"$f":"VLOOKUP(A297,[2]Ledenlijst!$B$2:$N$707,7,FALSE)","v":"S"}]
[6427,{"$f":"VLOOKUP(A298,[2]Ledenlijst!$B$2:$N$707,2,FALSE)","v":"GORLEER Omer"},{"$f":"VLOOKUP(A298,[2]Ledenlijst!$B$2:$N$707,13,FALSE)","v":"K.BCAW"},{"$f":"VLOOKUP(A298,[2]Ledenlijst!$B$2:$N$707,7,FALSE)","v":"S"}]
["KKKA1",{"$f":"VLOOKUP(A299,[2]Ledenlijst!$B$2:$N$707,2,FALSE)","v":"JACQUEMYN Tony"},{"$f":"VLOOKUP(A299,[2]Ledenlijst!$B$2:$N$707,13,FALSE)","v":"K.BCAW"},null,null,{"$f":"VLOOKUP(A299,[2]Ledenlijst!$B$2:$N$707,7,FALSE)","v":"K"}]
[9522,{"$f":"VLOOKUP(A300,[2]Ledenlijst!$B$2:$N$707,2,FALSE)","v":"LEEMAN Rudy"},{"$f":"VLOOKUP(A300,[2]Ledenlijst!$B$2:$N$707,13,FALSE)","v":"K.BCAW"},{"$f":"VLOOKUP(A300,[2]Ledenlijst!$B$2:$N$707,7,FALSE)","v":"S"}]
[9432,{"$f":"VLOOKUP(A301,[2]Ledenlijst!$B$2:$N$707,2,FALSE)","v":"VANAELST Paul"},{"$f":"VLOOKUP(A301,[2]Ledenlijst!$B$2:$N$707,13,FALSE)","v":"K.BCAW"},{"$f":"VLOOKUP(A301,[2]Ledenlijst!$B$2:$N$707,7,FALSE)","v":"S"}]
[4613,{"$f":"VLOOKUP(A302,[2]Ledenlijst!$B$2:$N$707,2,FALSE)","v":"VANDAELE Pierre - Florent"},{"$f":"VLOOKUP(A302,[2]Ledenlijst!$B$2:$N$707,13,FALSE)","v":"K.BCAW"},{"$f":"VLOOKUP(A302,[2]Ledenlijst!$B$2:$N$707,7,FALSE)","v":"S"}]
[7477,{"$f":"VLOOKUP(A303,[2]Ledenlijst!$B$2:$N$707,2,FALSE)","v":"VAN DE CASTEELE Henri"},{"$f":"VLOOKUP(A303,[2]Ledenlijst!$B$2:$N$707,13,FALSE)","v":"K.BCAW"},{"$f":"VLOOKUP(A303,[2]Ledenlijst!$B$2:$N$707,7,FALSE)","v":"S"}]
[7698,{"$f":"VLOOKUP(A304,[2]Ledenlijst!$B$2:$N$707,2,FALSE)","v":"VAN FLETEREN Piet"},{"$f":"VLOOKUP(A304,[2]Ledenlijst!$B$2:$N$707,13,FALSE)","v":"K.BCAW"},{"$f":"VLOOKUP(A304,[2]Ledenlijst!$B$2:$N$707,7,FALSE)","v":"S"},null,null,{"$f":"COUNTA(A293:A304)","v":12},null,"K.BCAW"]
[8347,{"$f":"VLOOKUP(A305,[2]Ledenlijst!$B$2:$N$707,2,FALSE)","v":"BUYENS Pascal"},{"$f":"VLOOKUP(A305,[2]Ledenlijst!$B$2:$N$707,13,FALSE)","v":"ROY"},{"$f":"VLOOKUP(A305,[2]Ledenlijst!$B$2:$N$707,7,FALSE)","v":"S"}]
[9262,{"$f":"VLOOKUP(A306,[2]Ledenlijst!$B$2:$N$707,2,FALSE)","v":"CLAEYS Hubert"},{"$f":"VLOOKUP(A306,[2]Ledenlijst!$B$2:$N$707,13,FALSE)","v":"ROY"},{"$f":"VLOOKUP(A306,[2]Ledenlijst!$B$2:$N$707,7,FALSE)","v":"S"}]
[8886,{"$f":"VLOOKUP(A307,[2]Ledenlijst!$B$2:$N$707,2,FALSE)","v":"DELTENRE Pascal"},{"$f":"VLOOKUP(A307,[2]Ledenlijst!$B$2:$N$707,13,FALSE)","v":"ROY"},{"$f":"VLOOKUP(A307,[2]Ledenlijst!$B$2:$N$707,7,FALSE)","v":"S"}]
[9264,{"$f":"VLOOKUP(A308,[2]Ledenlijst!$B$2:$N$707,2,FALSE)","v":"REYCHLER Hedwig"},{"$f":"VLOOKUP(A308,[2]Ledenlijst!$B$2:$N$707,13,FALSE)","v":"ROY"},{"$f":"VLOOKUP(A308,[2]Ledenlijst!$B$2:$N$707,7,FALSE)","v":"S"}]
["8918B",{"$f":"VLOOKUP(A309,[2]Ledenlijst!$B$2:$N$707,2,FALSE)","v":"VANDENBERGHE Pascal"},{"$f":"VLOOKUP(A309,[2]Ledenlijst!$B$2:$N$707,13,FALSE)","v":"ROY"},{"$f":"VLOOKUP(A309,[2]Ledenlijst!$B$2:$N$707,7,FALSE)","v":"S"}]
[8887,{"$f":"VLOOKUP(A310,[2]Ledenlijst!$B$2:$N$707,2,FALSE)","v":"VAN LANCKER Marc"},{"$f":"VLOOKUP(A310,[2]Ledenlijst!$B$2:$N$707,13,FALSE)","v":"ROY"},{"$f":"VLOOKUP(A310,[2]Ledenlijst!$B$2:$N$707,7,FALSE)","v":"S"},null,null,{"$f":"COUNTA(A305:A310)","v":6},null,"ROY"]
[4432,{"$f":"VLOOKUP(A311,[2]Ledenlijst!$B$2:$N$707,2,FALSE)","v":"BAETE Jean-Pierre"},{"$f":"VLOOKUP(A311,[2]Ledenlijst!$B$2:$N$707,13,FALSE)","v":"ACG"},{"$f":"VLOOKUP(A311,[2]Ledenlijst!$B$2:$N$707,7,FALSE)","v":"S"}]
[6705,{"$f":"VLOOKUP(A312,[2]Ledenlijst!$B$2:$N$707,2,FALSE)","v":"BERNAERDT Roland"},{"$f":"VLOOKUP(A312,[2]Ledenlijst!$B$2:$N$707,13,FALSE)","v":"ACG"},{"$f":"VLOOKUP(A312,[2]Ledenlijst!$B$2:$N$707,7,FALSE)","v":"S"}]
[4505,{"$f":"VLOOKUP(A313,[2]Ledenlijst!$B$2:$N$707,2,FALSE)","v":"BRACKE Peter"},{"$f":"VLOOKUP(A313,[2]Ledenlijst!$B$2:$N$707,13,FALSE)","v":"ACG"},{"$f":"VLOOKUP(A313,[2]Ledenlijst!$B$2:$N$707,7,FALSE)","v":"S"}]
["KKAC1",{"$f":"VLOOKUP(A314,[2]Ledenlijst!$B$2:$N$707,2,FALSE)","v":"CAUDRON Danny"},{"$f":"VLOOKUP(A314,[2]Ledenlijst!$B$2:$N$707,13,FALSE)","v":"ACG"},null,null,{"$f":"VLOOKUP(A314,[2]Ledenlijst!$B$2:$N$707,7,FALSE)","v":"K"}]
[1044,{"$f":"VLOOKUP(A315,[2]Ledenlijst!$B$2:$N$707,2,FALSE)","v":"COPPENS Jimmy"},{"$f":"VLOOKUP(A315,[2]Ledenlijst!$B$2:$N$707,13,FALSE)","v":"ACG"},{"$f":"VLOOKUP(A315,[2]Ledenlijst!$B$2:$N$707,7,FALSE)","v":"S"}]
[6927,{"$f":"VLOOKUP(A316,[2]Ledenlijst!$B$2:$N$707,2,FALSE)","v":"DUJARDIN Luc"},{"$f":"VLOOKUP(A316,[2]Ledenlijst!$B$2:$N$707,13,FALSE)","v":"ACG"},{"$f":"VLOOKUP(A316,[2]Ledenlijst!$B$2:$N$707,7,FALSE)","v":"S"}]
[8758,{"$f":"VLOOKUP(A317,[2]Ledenlijst!$B$2:$N$707,2,FALSE)","v":"DUYM Ignace"},{"$f":"VLOOKUP(A317,[2]Ledenlijst!$B$2:$N$707,13,FALSE)","v":"ACG"},{"$f":"VLOOKUP(A317,[2]Ledenlijst!$B$2:$N$707,7,FALSE)","v":"S"}]
["7685B",{"$f":"VLOOKUP(A318,[2]Ledenlijst!$B$2:$N$707,2,FALSE)","v":"HANSKENS Stefaan"},{"$f":"VLOOKUP(A318,[2]Ledenlijst!$B$2:$N$707,13,FALSE)","v":"ACG"},{"$f":"VLOOKUP(A318,[2]Ledenlijst!$B$2:$N$707,7,FALSE)","v":"S"}]
[9431,{"$f":"VLOOKUP(A319,[2]Ledenlijst!$B$2:$N$707,2,FALSE)","v":"JACQUEMYN Tony"},{"$f":"VLOOKUP(A319,[2]Ledenlijst!$B$2:$N$707,13,FALSE)","v":"ACG"},"S"]
[6428,{"$f":"VLOOKUP(A320,[2]Ledenlijst!$B$2:$N$707,2,FALSE)","v":"MEULEMAN Rudy"},{"$f":"VLOOKUP(A320,[2]Ledenlijst!$B$2:$N$707,13,FALSE)","v":"ACG"},{"$f":"VLOOKUP(A320,[2]Ledenlijst!$B$2:$N$707,7,FALSE)","v":"S"}]
[7125,{"$f":"VLOOKUP(A321,[2]Ledenlijst!$B$2:$N$707,2,FALSE)","v":"NUYTTEN Renold"},{"$f":"VLOOKUP(A321,[2]Ledenlijst!$B$2:$N$707,13,FALSE)","v":"ACG"},{"$f":"VLOOKUP(A321,[2]Ledenlijst!$B$2:$N$707,7,FALSE)","v":"S"}]
[2314,{"$f":"VLOOKUP(A322,[2]Ledenlijst!$B$2:$N$707,2,FALSE)","v":"SONCK Robby"},{"$f":"VLOOKUP(A322,[2]Ledenlijst!$B$2:$N$707,13,FALSE)","v":"ACG"},{"$f":"VLOOKUP(A322,[2]Ledenlijst!$B$2:$N$707,7,FALSE)","v":"S"}]
["LKAC1",{"$f":"VLOOKUP(A323,[2]Ledenlijst!$B$2:$N$707,2,FALSE)","v":"VAN DEN BOSSCHE Daniel"},{"$f":"VLOOKUP(A323,[2]Ledenlijst!$B$2:$N$707,13,FALSE)","v":"ACG"},{"$f":"VLOOKUP(A323,[2]Ledenlijst!$B$2:$N$707,7,FALSE)","v":"S"}]
[4496,{"$f":"VLOOKUP(A324,[2]Ledenlijst!$B$2:$N$707,2,FALSE)","v":"VAN HANEGEM Izaak"},{"$f":"VLOOKUP(A324,[2]Ledenlijst!$B$2:$N$707,13,FALSE)","v":"ACG"},{"$f":"VLOOKUP(A324,[2]Ledenlijst!$B$2:$N$707,7,FALSE)","v":"S"}]
[9975,{"$f":"VLOOKUP(A325,[2]Ledenlijst!$B$2:$N$707,2,FALSE)","v":"WILLEMS Peter"},{"$f":"VLOOKUP(A325,[2]Ledenlijst!$B$2:$N$707,13,FALSE)","v":"ACG"},{"$f":"VLOOKUP(A325,[2]Ledenlijst!$B$2:$N$707,7,FALSE)","v":"S"},null,null,{"$f":"COUNTA(A311:A325)","v":15},null,"ACG"]
[4451,{"$f":"VLOOKUP(A326,[2]Ledenlijst!$B$2:$N$707,2,FALSE)","v":"DE BLEECKER Steven"},{"$f":"VLOOKUP(A326,[2]Ledenlijst!$B$2:$N$707,13,FALSE)","v":"KAS"},{"$f":"VLOOKUP(A326,[2]Ledenlijst!$B$2:$N$707,7,FALSE)","v":"S"}]
[9964,{"$f":"VLOOKUP(A327,[2]Ledenlijst!$B$2:$N$707,2,FALSE)","v":"DE MEY Ad"},{"$f":"VLOOKUP(A327,[2]Ledenlijst!$B$2:$N$707,13,FALSE)","v":"KAS"},{"$f":"VLOOKUP(A327,[2]Ledenlijst!$B$2:$N$707,7,FALSE)","v":"S"}]
[8530,{"$f":"VLOOKUP(A328,[2]Ledenlijst!$B$2:$N$707,2,FALSE)","v":"DEMIRGIOCLU Fuat"},{"$f":"VLOOKUP(A328,[2]Ledenlijst!$B$2:$N$707,13,FALSE)","v":"KAS"},{"$f":"VLOOKUP(A328,[2]Ledenlijst!$B$2:$N$707,7,FALSE)","v":"S"}]
["4634B",{"$f":"VLOOKUP(A329,[2]Ledenlijst!$B$2:$N$707,2,FALSE)","v":"DEVLIEGER David"},{"$f":"VLOOKUP(A329,[2]Ledenlijst!$B$2:$N$707,13,FALSE)","v":"KAS"},{"$f":"VLOOKUP(A329,[2]Ledenlijst!$B$2:$N$707,7,FALSE)","v":"S"}]
["4513B",{"$f":"VLOOKUP(A330,[2]Ledenlijst!$B$2:$N$707,2,FALSE)","v":"DUYTSCHAEVER Peter"},{"$f":"VLOOKUP(A330,[2]Ledenlijst!$B$2:$N$707,13,FALSE)","v":"KAS"},{"$f":"VLOOKUP(A330,[2]Ledenlijst!$B$2:$N$707,7,FALSE)","v":"S"}]
[7207,{"$f":"VLOOKUP(A331,[2]Ledenlijst!$B$2:$N$707,2,FALSE)","v":"FEYS Georges"},{"$f":"VLOOKUP(A331,[2]Ledenlijst!$B$2:$N$707,13,FALSE)","v":"KAS"},{"$f":"VLOOKUP(A331,[2]Ledenlijst!$B$2:$N$707,7,FALSE)","v":"S"}]
[4516,{"$f":"VLOOKUP(A332,[2]Ledenlijst!$B$2:$N$707,2,FALSE)","v":"FEYS Gunther"},{"$f":"VLOOKUP(A332,[2]Ledenlijst!$B$2:$N$707,13,FALSE)","v":"KAS"},{"$f":"VLOOKUP(A332,[2]Ledenlijst!$B$2:$N$707,7,FALSE)","v":"S"}]
[8068,{"$f":"VLOOKUP(A333,[2]Ledenlijst!$B$2:$N$707,2,FALSE)","v":"KAHRAMAN Murat"},{"$f":"VLOOKUP(A333,[2]Ledenlijst!$B$2:$N$707,13,FALSE)","v":"KAS"},{"$f":"VLOOKUP(A333,[2]Ledenlijst!$B$2:$N$707,7,FALSE)","v":"S"}]
[5705,{"$f":"VLOOKUP(A334,[2]Ledenlijst!$B$2:$N$707,2,FALSE)","v":"LUTTENS Arnold"},{"$f":"VLOOKUP(A334,[2]Ledenlijst!$B$2:$N$707,13,FALSE)","v":"KAS"},{"$f":"VLOOKUP(A334,[2]Ledenlijst!$B$2:$N$707,7,FALSE)","v":"S"}]
[7687,{"$f":"VLOOKUP(A335,[2]Ledenlijst!$B$2:$N$707,2,FALSE)","v":"PIETERS Lionel"},{"$f":"VLOOKUP(A335,[2]Ledenlijst!$B$2:$N$707,13,FALSE)","v":"KAS"},{"$f":"VLOOKUP(A335,[2]Ledenlijst!$B$2:$N$707,7,FALSE)","v":"S"}]
[4524,{"$f":"VLOOKUP(A336,[2]Ledenlijst!$B$2:$N$707,2,FALSE)","v":"RODTS Piet"},{"$f":"VLOOKUP(A336,[2]Ledenlijst!$B$2:$N$707,13,FALSE)","v":"KAS"},{"$f":"VLOOKUP(A336,[2]Ledenlijst!$B$2:$N$707,7,FALSE)","v":"S"}]
[4402,{"$f":"VLOOKUP(A337,[2]Ledenlijst!$B$2:$N$707,2,FALSE)","v":"ROELS Roger"},{"$f":"VLOOKUP(A337,[2]Ledenlijst!$B$2:$N$707,13,FALSE)","v":"KAS"},{"$f":"VLOOKUP(A337,[2]Ledenlijst!$B$2:$N$707,7,FALSE)","v":"S"}]
[8895,{"$f":"VLOOKUP(A338,[2]Ledenlijst!$B$2:$N$707,2,FALSE)","v":"SANMODESTO José"},{"$f":"VLOOKUP(A338,[2]Ledenlijst!$B$2:$N$707,13,FALSE)","v":"KAS"},{"$f":"VLOOKUP(A338,[2]Ledenlijst!$B$2:$N$707,7,FALSE)","v":"S"}]
[9965,{"$f":"VLOOKUP(A339,[2]Ledenlijst!$B$2:$N$707,2,FALSE)","v":"SANMODESTO Nicolas"},{"$f":"VLOOKUP(A339,[2]Ledenlijst!$B$2:$N$707,13,FALSE)","v":"KAS"},{"$f":"VLOOKUP(A339,[2]Ledenlijst!$B$2:$N$707,7,FALSE)","v":"S"}]
[4526,{"$f":"VLOOKUP(A340,[2]Ledenlijst!$B$2:$N$707,2,FALSE)","v":"VAN DE VELDE Marc"},{"$f":"VLOOKUP(A340,[2]Ledenlijst!$B$2:$N$707,13,FALSE)","v":"KAS"},{"$f":"VLOOKUP(A340,[2]Ledenlijst!$B$2:$N$707,7,FALSE)","v":"S"}]
[8070,{"$f":"VLOOKUP(A341,[2]Ledenlijst!$B$2:$N$707,2,FALSE)","v":"VAN KERCKHOVE Willem"},{"$f":"VLOOKUP(A341,[2]Ledenlijst!$B$2:$N$707,13,FALSE)","v":"KAS"},{"$f":"VLOOKUP(A341,[2]Ledenlijst!$B$2:$N$707,7,FALSE)","v":"S"}]
[7209,{"$f":"VLOOKUP(A342,[2]Ledenlijst!$B$2:$N$707,2,FALSE)","v":"VAN WAEYENBERGHE Carlos"},{"$f":"VLOOKUP(A342,[2]Ledenlijst!$B$2:$N$707,13,FALSE)","v":"KAS"},{"$f":"VLOOKUP(A342,[2]Ledenlijst!$B$2:$N$707,7,FALSE)","v":"S"}]
["4530B",{"$f":"VLOOKUP(A343,[2]Ledenlijst!$B$2:$N$707,2,FALSE)","v":"VERSPEELT Filip"},{"$f":"VLOOKUP(A343,[2]Ledenlijst!$B$2:$N$707,13,FALSE)","v":"KAS"},{"$f":"VLOOKUP(A343,[2]Ledenlijst!$B$2:$N$707,7,FALSE)","v":"S"},null,null,{"$f":"COUNTA(A326:A343)","v":18},null,"KAS"]
[9057,{"$f":"VLOOKUP(A344,[2]Ledenlijst!$B$2:$N$707,2,FALSE)","v":"BONTE William"},{"$f":"VLOOKUP(A344,[2]Ledenlijst!$B$2:$N$707,13,FALSE)","v":"K.EBC"},{"$f":"VLOOKUP(A344,[2]Ledenlijst!$B$2:$N$707,7,FALSE)","v":"S"}]
[1046,{"$f":"VLOOKUP(A345,[2]Ledenlijst!$B$2:$N$707,2,FALSE)","v":"BRUGGEMAN Franky"},{"$f":"VLOOKUP(A345,[2]Ledenlijst!$B$2:$N$707,13,FALSE)","v":"K.EBC"},{"$f":"VLOOKUP(A345,[2]Ledenlijst!$B$2:$N$707,7,FALSE)","v":"S"}]
[9524,{"$f":"VLOOKUP(A346,[2]Ledenlijst!$B$2:$N$707,2,FALSE)","v":"CLAERHOUDT Robin"},{"$f":"VLOOKUP(A346,[2]Ledenlijst!$B$2:$N$707,13,FALSE)","v":"K.EBC"},{"$f":"VLOOKUP(A346,[2]Ledenlijst!$B$2:$N$707,7,FALSE)","v":"S"}]
[4473,{"$f":"VLOOKUP(A347,[2]Ledenlijst!$B$2:$N$707,2,FALSE)","v":"DE BAETS Ronny"},{"$f":"VLOOKUP(A347,[2]Ledenlijst!$B$2:$N$707,13,FALSE)","v":"K.EBC"},{"$f":"VLOOKUP(A347,[2]Ledenlijst!$B$2:$N$707,7,FALSE)","v":"S"}]
[9525,{"$f":"VLOOKUP(A348,[2]Ledenlijst!$B$2:$N$707,2,FALSE)","v":"de JONGE Cor"},{"$f":"VLOOKUP(A348,[2]Ledenlijst!$B$2:$N$707,13,FALSE)","v":"K.EBC"},{"$f":"VLOOKUP(A348,[2]Ledenlijst!$B$2:$N$707,7,FALSE)","v":"S"}]
[9067,{"$f":"VLOOKUP(A349,[2]Ledenlijst!$B$2:$N$707,2,FALSE)","v":"DE LETTER Sandra"},{"$f":"VLOOKUP(A349,[2]Ledenlijst!$B$2:$N$707,13,FALSE)","v":"K.EBC"},{"$f":"VLOOKUP(A349,[2]Ledenlijst!$B$2:$N$707,7,FALSE)","v":"S"}]
[4539,{"$f":"VLOOKUP(A350,[2]Ledenlijst!$B$2:$N$707,2,FALSE)","v":"DE MIL Christiaan"},{"$f":"VLOOKUP(A350,[2]Ledenlijst!$B$2:$N$707,13,FALSE)","v":"K.EBC"},{"$f":"VLOOKUP(A350,[2]Ledenlijst!$B$2:$N$707,7,FALSE)","v":"S"}]
[4395,{"$f":"VLOOKUP(A351,[2]Ledenlijst!$B$2:$N$707,2,FALSE)","v":"DE PAEPE Roland"},{"$f":"VLOOKUP(A351,[2]Ledenlijst!$B$2:$N$707,13,FALSE)","v":"K.EBC"},{"$f":"VLOOKUP(A351,[2]Ledenlijst!$B$2:$N$707,7,FALSE)","v":"S"}]
["6727B",{"$f":"VLOOKUP(A352,[2]Ledenlijst!$B$2:$N$707,2,FALSE)","v":"DE RYNCK Ivan"},{"$f":"VLOOKUP(A352,[2]Ledenlijst!$B$2:$N$707,13,FALSE)","v":"K.EBC"},{"$f":"VLOOKUP(A352,[2]Ledenlijst!$B$2:$N$707,7,FALSE)","v":"S"}]
[4446,{"$f":"VLOOKUP(A353,[2]Ledenlijst!$B$2:$N$707,2,FALSE)","v":"FOURNEAU Alain"},{"$f":"VLOOKUP(A353,[2]Ledenlijst!$B$2:$N$707,13,FALSE)","v":"K.EBC"},{"$f":"VLOOKUP(A353,[2]Ledenlijst!$B$2:$N$707,7,FALSE)","v":"S"}]
[7474,{"$f":"VLOOKUP(A354,[2]Ledenlijst!$B$2:$N$707,2,FALSE)","v":"GEIRNAERT Marc"},{"$f":"VLOOKUP(A354,[2]Ledenlijst!$B$2:$N$707,13,FALSE)","v":"K.EBC"},{"$f":"VLOOKUP(A354,[2]Ledenlijst!$B$2:$N$707,7,FALSE)","v":"S"}]
[4544,{"$f":"VLOOKUP(A355,[2]Ledenlijst!$B$2:$N$707,2,FALSE)","v":"GEVAERT Michel"},{"$f":"VLOOKUP(A355,[2]Ledenlijst!$B$2:$N$707,13,FALSE)","v":"K.EBC"},{"$f":"VLOOKUP(A355,[2]Ledenlijst!$B$2:$N$707,7,FALSE)","v":"S"}]
[4545,{"$f":"VLOOKUP(A356,[2]Ledenlijst!$B$2:$N$707,2,FALSE)","v":"GOETHALS Armand"},{"$f":"VLOOKUP(A356,[2]Ledenlijst!$B$2:$N$707,13,FALSE)","v":"K.EBC"},{"$f":"VLOOKUP(A356,[2]Ledenlijst!$B$2:$N$707,7,FALSE)","v":"S"}]
[5015,{"$f":"VLOOKUP(A357,[2]Ledenlijst!$B$2:$N$707,2,FALSE)","v":"HIMSCHOOT Daniel"},{"$f":"VLOOKUP(A357,[2]Ledenlijst!$B$2:$N$707,13,FALSE)","v":"K.EBC"},{"$f":"VLOOKUP(A357,[2]Ledenlijst!$B$2:$N$707,7,FALSE)","v":"S"}]
[7479,{"$f":"VLOOKUP(A358,[2]Ledenlijst!$B$2:$N$707,2,FALSE)","v":"HONGENAERT Erwin"},{"$f":"VLOOKUP(A358,[2]Ledenlijst!$B$2:$N$707,13,FALSE)","v":"K.EBC"},{"$f":"VLOOKUP(A358,[2]Ledenlijst!$B$2:$N$707,7,FALSE)","v":"S"}]
[4548,{"$f":"VLOOKUP(A359,[2]Ledenlijst!$B$2:$N$707,2,FALSE)","v":"IMMESOETE Amaat"},{"$f":"VLOOKUP(A359,[2]Ledenlijst!$B$2:$N$707,13,FALSE)","v":"K.EBC"},{"$f":"VLOOKUP(A359,[2]Ledenlijst!$B$2:$N$707,7,FALSE)","v":"S"}]
[9267,{"$f":"VLOOKUP(A360,[2]Ledenlijst!$B$2:$N$707,2,FALSE)","v":"JANSSEN Willem"},{"$f":"VLOOKUP(A360,[2]Ledenlijst!$B$2:$N$707,13,FALSE)","v":"K.EBC"},{"$f":"VLOOKUP(A360,[2]Ledenlijst!$B$2:$N$707,7,FALSE)","v":"S"}]
[8659,{"$f":"VLOOKUP(A361,[2]Ledenlijst!$B$2:$N$707,2,FALSE)","v":"LAMPAERT Eddy"},{"$f":"VLOOKUP(A361,[2]Ledenlijst!$B$2:$N$707,13,FALSE)","v":"K.EBC"},{"$f":"VLOOKUP(A361,[2]Ledenlijst!$B$2:$N$707,7,FALSE)","v":"S"}]
[1022,{"$f":"VLOOKUP(A362,[2]Ledenlijst!$B$2:$N$707,2,FALSE)","v":"MENHEER Leslie"},{"$f":"VLOOKUP(A362,[2]Ledenlijst!$B$2:$N$707,13,FALSE)","v":"K.EBC"},{"$f":"VLOOKUP(A362,[2]Ledenlijst!$B$2:$N$707,7,FALSE)","v":"S"}]
[7036,{"$f":"VLOOKUP(A363,[2]Ledenlijst!$B$2:$N$707,2,FALSE)","v":"MISMAN Eddy"},{"$f":"VLOOKUP(A363,[2]Ledenlijst!$B$2:$N$707,13,FALSE)","v":"K.EBC"},{"$f":"VLOOKUP(A363,[2]Ledenlijst!$B$2:$N$707,7,FALSE)","v":"S"}]
[4558,{"$f":"VLOOKUP(A364,[2]Ledenlijst!$B$2:$N$707,2,FALSE)","v":"SIMOENS Wilfried"},{"$f":"VLOOKUP(A364,[2]Ledenlijst!$B$2:$N$707,13,FALSE)","v":"K.EBC"},{"$f":"VLOOKUP(A364,[2]Ledenlijst!$B$2:$N$707,7,FALSE)","v":"S"}]
[4482,{"$f":"VLOOKUP(A365,[2]Ledenlijst!$B$2:$N$707,2,FALSE)","v":"STAELENS Freddy"},{"$f":"VLOOKUP(A365,[2]Ledenlijst!$B$2:$N$707,13,FALSE)","v":"K.EBC"},{"$f":"VLOOKUP(A365,[2]Ledenlijst!$B$2:$N$707,7,FALSE)","v":"S"}]
[4559,{"$f":"VLOOKUP(A366,[2]Ledenlijst!$B$2:$N$707,2,FALSE)","v":"STANDAERT Arthur"},{"$f":"VLOOKUP(A366,[2]Ledenlijst!$B$2:$N$707,13,FALSE)","v":"K.EBC"},{"$f":"VLOOKUP(A366,[2]Ledenlijst!$B$2:$N$707,7,FALSE)","v":"S"}]
[4560,{"$f":"VLOOKUP(A367,[2]Ledenlijst!$B$2:$N$707,2,FALSE)","v":"STANDAERT Peter"},{"$f":"VLOOKUP(A367,[2]Ledenlijst!$B$2:$N$707,13,FALSE)","v":"K.EBC"},{"$f":"VLOOKUP(A367,[2]Ledenlijst!$B$2:$N$707,7,FALSE)","v":"S"}]
[5212,{"$f":"VLOOKUP(A368,[2]Ledenlijst!$B$2:$N$707,2,FALSE)","v":"STEVENS Martin"},{"$f":"VLOOKUP(A368,[2]Ledenlijst!$B$2:$N$707,13,FALSE)","v":"K.EBC"},{"$f":"VLOOKUP(A368,[2]Ledenlijst!$B$2:$N$707,7,FALSE)","v":"S"}]
[4609,{"$f":"VLOOKUP(A369,[2]Ledenlijst!$B$2:$N$707,2,FALSE)","v":"VAN ACKER Jan"},{"$f":"VLOOKUP(A369,[2]Ledenlijst!$B$2:$N$707,13,FALSE)","v":"K.EBC"},{"$f":"VLOOKUP(A369,[2]Ledenlijst!$B$2:$N$707,7,FALSE)","v":"S"}]
[7312,{"$f":"VLOOKUP(A370,[2]Ledenlijst!$B$2:$N$707,2,FALSE)","v":"VAN ACKER Johan"},{"$f":"VLOOKUP(A370,[2]Ledenlijst!$B$2:$N$707,13,FALSE)","v":"K.EBC"},{"$f":"VLOOKUP(A370,[2]Ledenlijst!$B$2:$N$707,7,FALSE)","v":"S"}]
[6094,{"$f":"VLOOKUP(A371,[2]Ledenlijst!$B$2:$N$707,2,FALSE)","v":"VAN ACKER Steven"},{"$f":"VLOOKUP(A371,[2]Ledenlijst!$B$2:$N$707,13,FALSE)","v":"K.EBC"},{"$f":"VLOOKUP(A371,[2]Ledenlijst!$B$2:$N$707,7,FALSE)","v":"S"}]
[4561,{"$f":"VLOOKUP(A372,[2]Ledenlijst!$B$2:$N$707,2,FALSE)","v":"VAN DAMME Etienne"},{"$f":"VLOOKUP(A372,[2]Ledenlijst!$B$2:$N$707,13,FALSE)","v":"K.EBC"},{"$f":"VLOOKUP(A372,[2]Ledenlijst!$B$2:$N$707,7,FALSE)","v":"S"}]
[6097,{"$f":"VLOOKUP(A373,[2]Ledenlijst!$B$2:$N$707,2,FALSE)","v":"VAN DE VOORDE Johan"},{"$f":"VLOOKUP(A373,[2]Ledenlijst!$B$2:$N$707,13,FALSE)","v":"K.EBC"},{"$f":"VLOOKUP(A373,[2]Ledenlijst!$B$2:$N$707,7,FALSE)","v":"S"}]
[4490,{"$f":"VLOOKUP(A374,[2]Ledenlijst!$B$2:$N$707,2,FALSE)","v":"VAN LANCKER Pierre"},{"$f":"VLOOKUP(A374,[2]Ledenlijst!$B$2:$N$707,13,FALSE)","v":"K.EBC"},{"$f":"VLOOKUP(A374,[2]Ledenlijst!$B$2:$N$707,7,FALSE)","v":"S"}]
[4567,{"$f":"VLOOKUP(A375,[2]Ledenlijst!$B$2:$N$707,2,FALSE)","v":"VLERICK Raf"},{"$f":"VLOOKUP(A375,[2]Ledenlijst!$B$2:$N$707,13,FALSE)","v":"K.EBC"},{"$f":"VLOOKUP(A375,[2]Ledenlijst!$B$2:$N$707,7,FALSE)","v":"S"}]
[6709,{"$f":"VLOOKUP(A376,[2]Ledenlijst!$B$2:$N$707,2,FALSE)","v":"WELVAERT Yves"},{"$f":"VLOOKUP(A376,[2]Ledenlijst!$B$2:$N$707,13,FALSE)","v":"K.EBC"},{"$f":"VLOOKUP(A376,[2]Ledenlijst!$B$2:$N$707,7,FALSE)","v":"S"},null,null,{"$f":"COUNTA(A344:A376)","v":33},null,"K.EBC"]
[9807,"DEBRUYKER Pierre","K.EBC"]
[4392,{"$f":"VLOOKUP(A378,[2]Ledenlijst!$B$2:$N$707,2,FALSE)","v":"BOELAERT Eddie"},{"$f":"VLOOKUP(A378,[2]Ledenlijst!$B$2:$N$707,13,FALSE)","v":"UN"},{"$f":"VLOOKUP(A378,[2]Ledenlijst!$B$2:$N$707,7,FALSE)","v":"S"}]
["8888B",{"$f":"VLOOKUP(A379,[2]Ledenlijst!$B$2:$N$707,2,FALSE)","v":"DE MEYER Erik"},{"$f":"VLOOKUP(A379,[2]Ledenlijst!$B$2:$N$707,13,FALSE)","v":"UN"},{"$f":"VLOOKUP(A379,[2]Ledenlijst!$B$2:$N$707,7,FALSE)","v":"S"}]
[4511,{"$f":"VLOOKUP(A380,[2]Ledenlijst!$B$2:$N$707,2,FALSE)","v":"DE PAUW Lucien"},{"$f":"VLOOKUP(A380,[2]Ledenlijst!$B$2:$N$707,13,FALSE)","v":"UN"},{"$f":"VLOOKUP(A380,[2]Ledenlijst!$B$2:$N$707,7,FALSE)","v":"S"}]
[4634,{"$f":"VLOOKUP(A381,[2]Ledenlijst!$B$2:$N$707,2,FALSE)","v":"DEVLIEGER David"},{"$f":"VLOOKUP(A381,[2]Ledenlijst!$B$2:$N$707,13,FALSE)","v":"UN"},{"$f":"VLOOKUP(A381,[2]Ledenlijst!$B$2:$N$707,7,FALSE)","v":"S"}]
[4399,{"$f":"VLOOKUP(A382,[2]Ledenlijst!$B$2:$N$707,2,FALSE)","v":"DIERKENS Antoine"},{"$f":"VLOOKUP(A382,[2]Ledenlijst!$B$2:$N$707,13,FALSE)","v":"UN"},{"$f":"VLOOKUP(A382,[2]Ledenlijst!$B$2:$N$707,7,FALSE)","v":"S"}]
[4456,{"$f":"VLOOKUP(A383,[2]Ledenlijst!$B$2:$N$707,2,FALSE)","v":"DUPONT Jean-Claude"},{"$f":"VLOOKUP(A383,[2]Ledenlijst!$B$2:$N$707,13,FALSE)","v":"UN"},{"$f":"VLOOKUP(A383,[2]Ledenlijst!$B$2:$N$707,7,FALSE)","v":"S"}]
[4513,{"$f":"VLOOKUP(A384,[2]Ledenlijst!$B$2:$N$707,2,FALSE)","v":"DUYTSCHAEVER Peter"},{"$f":"VLOOKUP(A384,[2]Ledenlijst!$B$2:$N$707,13,FALSE)","v":"UN"},{"$f":"VLOOKUP(A384,[2]Ledenlijst!$B$2:$N$707,7,FALSE)","v":"S"}]
[4514,{"$f":"VLOOKUP(A385,[2]Ledenlijst!$B$2:$N$707,2,FALSE)","v":"DUYTSCHAEVER Roger"},{"$f":"VLOOKUP(A385,[2]Ledenlijst!$B$2:$N$707,13,FALSE)","v":"UN"},{"$f":"VLOOKUP(A385,[2]Ledenlijst!$B$2:$N$707,7,FALSE)","v":"S"}]
[8148,{"$f":"VLOOKUP(A386,[2]Ledenlijst!$B$2:$N$707,2,FALSE)","v":"EVERAERT Santino"},{"$f":"VLOOKUP(A386,[2]Ledenlijst!$B$2:$N$707,13,FALSE)","v":"UN"},{"$f":"VLOOKUP(A386,[2]Ledenlijst!$B$2:$N$707,7,FALSE)","v":"S"}]
[7303,{"$f":"VLOOKUP(A387,[2]Ledenlijst!$B$2:$N$707,2,FALSE)","v":"FRANCK Franky"},{"$f":"VLOOKUP(A387,[2]Ledenlijst!$B$2:$N$707,13,FALSE)","v":"UN"},{"$f":"VLOOKUP(A387,[2]Ledenlijst!$B$2:$N$707,7,FALSE)","v":"S"}]
[9269,{"$f":"VLOOKUP(A388,[2]Ledenlijst!$B$2:$N$707,2,FALSE)","v":"GEIRNAERT Emile"},{"$f":"VLOOKUP(A388,[2]Ledenlijst!$B$2:$N$707,13,FALSE)","v":"UN"},{"$f":"VLOOKUP(A388,[2]Ledenlijst!$B$2:$N$707,7,FALSE)","v":"S"}]
[4435,{"$f":"VLOOKUP(A389,[2]Ledenlijst!$B$2:$N$707,2,FALSE)","v":"HERREMAN Roger"},{"$f":"VLOOKUP(A389,[2]Ledenlijst!$B$2:$N$707,13,FALSE)","v":"UN"},{"$f":"VLOOKUP(A389,[2]Ledenlijst!$B$2:$N$707,7,FALSE)","v":"S"}]
[4574,{"$f":"VLOOKUP(A390,[2]Ledenlijst!$B$2:$N$707,2,FALSE)","v":"HOFMAN Raf"},{"$f":"VLOOKUP(A390,[2]Ledenlijst!$B$2:$N$707,13,FALSE)","v":"UN"},{"$f":"VLOOKUP(A390,[2]Ledenlijst!$B$2:$N$707,7,FALSE)","v":"S"}]
[4400,{"$f":"VLOOKUP(A391,[2]Ledenlijst!$B$2:$N$707,2,FALSE)","v":"LAMBOTTE Rik"},{"$f":"VLOOKUP(A391,[2]Ledenlijst!$B$2:$N$707,13,FALSE)","v":"UN"},{"$f":"VLOOKUP(A391,[2]Ledenlijst!$B$2:$N$707,7,FALSE)","v":"S"}]
[8125,{"$f":"VLOOKUP(A392,[2]Ledenlijst!$B$2:$N$707,2,FALSE)","v":"LANDRIEU Jan"},{"$f":"VLOOKUP(A392,[2]Ledenlijst!$B$2:$N$707,13,FALSE)","v":"UN"},{"$f":"VLOOKUP(A392,[2]Ledenlijst!$B$2:$N$707,7,FALSE)","v":"S"}]
[4551,{"$f":"VLOOKUP(A393,[2]Ledenlijst!$B$2:$N$707,2,FALSE)","v":"LEMAN Gwen"},{"$f":"VLOOKUP(A393,[2]Ledenlijst!$B$2:$N$707,13,FALSE)","v":"UN"},{"$f":"VLOOKUP(A393,[2]Ledenlijst!$B$2:$N$707,7,FALSE)","v":"S"}]
[4552,{"$f":"VLOOKUP(A394,[2]Ledenlijst!$B$2:$N$707,2,FALSE)","v":"LEMAN Willy"},{"$f":"VLOOKUP(A394,[2]Ledenlijst!$B$2:$N$707,13,FALSE)","v":"UN"},{"$f":"VLOOKUP(A394,[2]Ledenlijst!$B$2:$N$707,7,FALSE)","v":"S"}]
[9526,{"$f":"VLOOKUP(A395,[2]Ledenlijst!$B$2:$N$707,2,FALSE)","v":"LEURIDON Jean-Pierre"},{"$f":"VLOOKUP(A395,[2]Ledenlijst!$B$2:$N$707,13,FALSE)","v":"UN"},{"$f":"VLOOKUP(A395,[2]Ledenlijst!$B$2:$N$707,7,FALSE)","v":"S"}]
[4519,{"$f":"VLOOKUP(A396,[2]Ledenlijst!$B$2:$N$707,2,FALSE)","v":"MALFAIT Michel"},{"$f":"VLOOKUP(A396,[2]Ledenlijst!$B$2:$N$707,13,FALSE)","v":"UN"},{"$f":"VLOOKUP(A396,[2]Ledenlijst!$B$2:$N$707,7,FALSE)","v":"S"}]
[4520,{"$f":"VLOOKUP(A397,[2]Ledenlijst!$B$2:$N$707,2,FALSE)","v":"MARTENS Johan"},{"$f":"VLOOKUP(A397,[2]Ledenlijst!$B$2:$N$707,13,FALSE)","v":"UN"},{"$f":"VLOOKUP(A397,[2]Ledenlijst!$B$2:$N$707,7,FALSE)","v":"S"}]
[4732,{"$f":"VLOOKUP(A398,[2]Ledenlijst!$B$2:$N$707,2,FALSE)","v":"NACHTERGAELE Geert"},{"$f":"VLOOKUP(A398,[2]Ledenlijst!$B$2:$N$707,13,FALSE)","v":"UN"},{"$f":"VLOOKUP(A398,[2]Ledenlijst!$B$2:$N$707,7,FALSE)","v":"S"}]
[8891,{"$f":"VLOOKUP(A399,[2]Ledenlijst!$B$2:$N$707,2,FALSE)","v":"PLATEAU Tiani"},{"$f":"VLOOKUP(A399,[2]Ledenlijst!$B$2:$N$707,13,FALSE)","v":"UN"},{"$f":"VLOOKUP(A399,[2]Ledenlijst!$B$2:$N$707,7,FALSE)","v":"S"}]
[4965,{"$f":"VLOOKUP(A400,[2]Ledenlijst!$B$2:$N$707,2,FALSE)","v":"ROSSEL Bart"},{"$f":"VLOOKUP(A400,[2]Ledenlijst!$B$2:$N$707,13,FALSE)","v":"UN"},{"$f":"VLOOKUP(A400,[2]Ledenlijst!$B$2:$N$707,7,FALSE)","v":"S"}]
[4966,{"$f":"VLOOKUP(A401,[2]Ledenlijst!$B$2:$N$707,2,FALSE)","v":"ROSSEL Francis"},{"$f":"VLOOKUP(A401,[2]Ledenlijst!$B$2:$N$707,13,FALSE)","v":"UN"},{"$f":"VLOOKUP(A401,[2]Ledenlijst!$B$2:$N$707,7,FALSE)","v":"S"}]
[9069,{"$f":"VLOOKUP(A402,[2]Ledenlijst!$B$2:$N$707,2,FALSE)","v":"SOMNEL Noël"},{"$f":"VLOOKUP(A402,[2]Ledenlijst!$B$2:$N$707,13,FALSE)","v":"UN"},{"$f":"VLOOKUP(A402,[2]Ledenlijst!$B$2:$N$707,7,FALSE)","v":"S"}]
[4407,{"$f":"VLOOKUP(A403,[2]Ledenlijst!$B$2:$N$707,2,FALSE)","v":"STEELS Dieter"},{"$f":"VLOOKUP(A403,[2]Ledenlijst!$B$2:$N$707,13,FALSE)","v":"UN"},{"$f":"VLOOKUP(A403,[2]Ledenlijst!$B$2:$N$707,7,FALSE)","v":"S"}]
[8660,{"$f":"VLOOKUP(A404,[2]Ledenlijst!$B$2:$N$707,2,FALSE)","v":"TEMMERMAN Eduard"},{"$f":"VLOOKUP(A404,[2]Ledenlijst!$B$2:$N$707,13,FALSE)","v":"UN"},{"$f":"VLOOKUP(A404,[2]Ledenlijst!$B$2:$N$707,7,FALSE)","v":"S"}]
[4581,{"$f":"VLOOKUP(A405,[2]Ledenlijst!$B$2:$N$707,2,FALSE)","v":"VAN HOOYDONK Guy"},{"$f":"VLOOKUP(A405,[2]Ledenlijst!$B$2:$N$707,13,FALSE)","v":"UN"},{"$f":"VLOOKUP(A405,[2]Ledenlijst!$B$2:$N$707,7,FALSE)","v":"S"}]
[4583,{"$f":"VLOOKUP(A406,[2]Ledenlijst!$B$2:$N$707,2,FALSE)","v":"VAN SPEYBROECK Pierre"},{"$f":"VLOOKUP(A406,[2]Ledenlijst!$B$2:$N$707,13,FALSE)","v":"UN"},{"$f":"VLOOKUP(A406,[2]Ledenlijst!$B$2:$N$707,7,FALSE)","v":"S"}]
[6930,{"$f":"VLOOKUP(A407,[2]Ledenlijst!$B$2:$N$707,2,FALSE)","v":"VERHELST Daniel"},{"$f":"VLOOKUP(A407,[2]Ledenlijst!$B$2:$N$707,13,FALSE)","v":"UN"},{"$f":"VLOOKUP(A407,[2]Ledenlijst!$B$2:$N$707,7,FALSE)","v":"S"}]
[8168,{"$f":"VLOOKUP(A408,[2]Ledenlijst!$B$2:$N$707,2,FALSE)","v":"VERWEE Julien"},{"$f":"VLOOKUP(A408,[2]Ledenlijst!$B$2:$N$707,13,FALSE)","v":"UN"},{"$f":"VLOOKUP(A408,[2]Ledenlijst!$B$2:$N$707,7,FALSE)","v":"S"}]
[7471,{"$f":"VLOOKUP(A409,[2]Ledenlijst!$B$2:$N$707,2,FALSE)","v":"WIELEMANS Gustaaf"},{"$f":"VLOOKUP(A409,[2]Ledenlijst!$B$2:$N$707,13,FALSE)","v":"UN"},{"$f":"VLOOKUP(A409,[2]Ledenlijst!$B$2:$N$707,7,FALSE)","v":"S"}]
[4531,{"$f":"VLOOKUP(A410,[2]Ledenlijst!$B$2:$N$707,2,FALSE)","v":"WULFRANCK Luc"},{"$f":"VLOOKUP(A410,[2]Ledenlijst!$B$2:$N$707,13,FALSE)","v":"UN"},{"$f":"VLOOKUP(A410,[2]Ledenlijst!$B$2:$N$707,7,FALSE)","v":"S"},null,null,{"$f":"COUNTA(A378:A410)","v":33},null,"UN"]
["KKK1",{"$f":"VLOOKUP(A411,[2]Ledenlijst!$B$2:$N$707,2,FALSE)","v":"BAELE Edmond"},{"$f":"VLOOKUP(A411,[2]Ledenlijst!$B$2:$N$707,13,FALSE)","v":"KOTM"},null,null,{"$f":"VLOOKUP(A411,[2]Ledenlijst!$B$2:$N$707,7,FALSE)","v":"K"}]
[9129,{"$f":"VLOOKUP(A412,[2]Ledenlijst!$B$2:$N$707,2,FALSE)","v":"DE GRAAF Jackie"},{"$f":"VLOOKUP(A412,[2]Ledenlijst!$B$2:$N$707,13,FALSE)","v":"KOTM"},{"$f":"VLOOKUP(A412,[2]Ledenlijst!$B$2:$N$707,7,FALSE)","v":"S"}]
[4617,{"$f":"VLOOKUP(A413,[2]Ledenlijst!$B$2:$N$707,2,FALSE)","v":"JANSSENS Marcel"},{"$f":"VLOOKUP(A413,[2]Ledenlijst!$B$2:$N$707,13,FALSE)","v":"KOTM"},{"$f":"VLOOKUP(A413,[2]Ledenlijst!$B$2:$N$707,7,FALSE)","v":"S"}]
[9238,{"$f":"VLOOKUP(A414,[2]Ledenlijst!$B$2:$N$707,2,FALSE)","v":"SIMONS Rudi"},{"$f":"VLOOKUP(A414,[2]Ledenlijst!$B$2:$N$707,13,FALSE)","v":"KOTM"},{"$f":"VLOOKUP(A414,[2]Ledenlijst!$B$2:$N$707,7,FALSE)","v":"S"},null,null,{"$f":"COUNTA(A411:A414)","v":4},null,"KOTM"]
[8666,{"$f":"VLOOKUP(A415,[2]Ledenlijst!$B$2:$N$707,2,FALSE)","v":"BRACKE André"},{"$f":"VLOOKUP(A415,[2]Ledenlijst!$B$2:$N$707,13,FALSE)","v":"K.ME"},{"$f":"VLOOKUP(A415,[2]Ledenlijst!$B$2:$N$707,7,FALSE)","v":"S"}]
[6715,{"$f":"VLOOKUP(A416,[2]Ledenlijst!$B$2:$N$707,2,FALSE)","v":"BRUGGEMAN Roger"},{"$f":"VLOOKUP(A416,[2]Ledenlijst!$B$2:$N$707,13,FALSE)","v":"K.ME"},{"$f":"VLOOKUP(A416,[2]Ledenlijst!$B$2:$N$707,7,FALSE)","v":"S"}]
[4643,{"$f":"VLOOKUP(A417,[2]Ledenlijst!$B$2:$N$707,2,FALSE)","v":"MESURE Freddy"},{"$f":"VLOOKUP(A417,[2]Ledenlijst!$B$2:$N$707,13,FALSE)","v":"K.ME"},{"$f":"VLOOKUP(A417,[2]Ledenlijst!$B$2:$N$707,7,FALSE)","v":"S"}]
[8664,{"$f":"VLOOKUP(A418,[2]Ledenlijst!$B$2:$N$707,2,FALSE)","v":"OOSTERLINCK Luc"},{"$f":"VLOOKUP(A418,[2]Ledenlijst!$B$2:$N$707,13,FALSE)","v":"K.ME"},{"$f":"VLOOKUP(A418,[2]Ledenlijst!$B$2:$N$707,7,FALSE)","v":"S"}]
[8898,{"$f":"VLOOKUP(A419,[2]Ledenlijst!$B$2:$N$707,2,FALSE)","v":"RAES Freddy"},{"$f":"VLOOKUP(A419,[2]Ledenlijst!$B$2:$N$707,13,FALSE)","v":"K.ME"},{"$f":"VLOOKUP(A419,[2]Ledenlijst!$B$2:$N$707,7,FALSE)","v":"S"}]
[8665,{"$f":"VLOOKUP(A420,[2]Ledenlijst!$B$2:$N$707,2,FALSE)","v":"VAN DELSEN Edgard"},{"$f":"VLOOKUP(A420,[2]Ledenlijst!$B$2:$N$707,13,FALSE)","v":"K.ME"},{"$f":"VLOOKUP(A420,[2]Ledenlijst!$B$2:$N$707,7,FALSE)","v":"S"}]
[4415,{"$f":"VLOOKUP(A421,[2]Ledenlijst!$B$2:$N$707,2,FALSE)","v":"VANPETEGHEM Alex"},{"$f":"VLOOKUP(A421,[2]Ledenlijst!$B$2:$N$707,13,FALSE)","v":"K.ME"},{"$f":"VLOOKUP(A421,[2]Ledenlijst!$B$2:$N$707,7,FALSE)","v":"S"}]
[4443,{"$f":"VLOOKUP(A422,[2]Ledenlijst!$B$2:$N$707,2,FALSE)","v":"VERBEKEN Albert"},{"$f":"VLOOKUP(A422,[2]Ledenlijst!$B$2:$N$707,13,FALSE)","v":"K.ME"},{"$f":"VLOOKUP(A422,[2]Ledenlijst!$B$2:$N$707,7,FALSE)","v":"S"},null,null,{"$f":"COUNTA(A415:A422)","v":8},null,"K.ME"]
[]
[null,null,{"$f":"COUNTA(C211:C423)","v":212},{"$f":"COUNTA(D211:D423)","v":196},{"$f":"COUNTA(E211:E423)","v":2},{"$f":"COUNTA(F211:F423)","v":13},null,{"$f":"SUM(G211:G423)","v":211},"Gent"]
[]
[]
[5717,{"$f":"VLOOKUP(A427,[2]Ledenlijst!$B$2:$N$707,2,FALSE)","v":"ACX Dirk"},{"$f":"VLOOKUP(A427,[2]Ledenlijst!$B$2:$N$707,13,FALSE)","v":"WOH"},{"$f":"VLOOKUP(A427,[2]Ledenlijst!$B$2:$N$707,7,FALSE)","v":"S"}]
[8872,{"$f":"VLOOKUP(A428,[2]Ledenlijst!$B$2:$N$707,2,FALSE)","v":"BEIRNAERT Arthur"},{"$f":"VLOOKUP(A428,[2]Ledenlijst!$B$2:$N$707,13,FALSE)","v":"WOH"},{"$f":"VLOOKUP(A428,[2]Ledenlijst!$B$2:$N$707,7,FALSE)","v":"S"}]
["7465B",{"$f":"VLOOKUP(A429,[2]Ledenlijst!$B$2:$N$707,2,FALSE)","v":"COUSSEMENT Wim"},{"$f":"VLOOKUP(A429,[2]Ledenlijst!$B$2:$N$707,13,FALSE)","v":"WOH"},null,null,{"$f":"VLOOKUP(A429,[2]Ledenlijst!$B$2:$N$707,7,FALSE)","v":"K"}]
[8875,{"$f":"VLOOKUP(A430,[2]Ledenlijst!$B$2:$N$707,2,FALSE)","v":"DEBUSSCHERE Dries"},{"$f":"VLOOKUP(A430,[2]Ledenlijst!$B$2:$N$707,13,FALSE)","v":"WOH"},null,{"$f":"VLOOKUP(A430,[2]Ledenlijst!$B$2:$N$707,7,FALSE)","v":"J"}]
[7314,{"$f":"VLOOKUP(A431,[2]Ledenlijst!$B$2:$N$707,2,FALSE)","v":"DEMAN Leon"},{"$f":"VLOOKUP(A431,[2]Ledenlijst!$B$2:$N$707,13,FALSE)","v":"WOH"},{"$f":"VLOOKUP(A431,[2]Ledenlijst!$B$2:$N$707,7,FALSE)","v":"S"}]
[9270,{"$f":"VLOOKUP(A432,[2]Ledenlijst!$B$2:$N$707,2,FALSE)","v":"DESWARTE Franky"},{"$f":"VLOOKUP(A432,[2]Ledenlijst!$B$2:$N$707,13,FALSE)","v":"WOH"},{"$f":"VLOOKUP(A432,[2]Ledenlijst!$B$2:$N$707,7,FALSE)","v":"S"}]
["00844",{"$f":"VLOOKUP(A433,[2]Ledenlijst!$B$2:$N$707,2,FALSE)","v":"DEVOS Claude"},{"$f":"VLOOKUP(A433,[2]Ledenlijst!$B$2:$N$707,13,FALSE)","v":"WOH"},null,null,{"$f":"VLOOKUP(A433,[2]Ledenlijst!$B$2:$N$707,7,FALSE)","v":"K"}]
[4691,{"$f":"VLOOKUP(A434,[2]Ledenlijst!$B$2:$N$707,2,FALSE)","v":"D'HONDT Hervé"},{"$f":"VLOOKUP(A434,[2]Ledenlijst!$B$2:$N$707,13,FALSE)","v":"WOH"},{"$f":"VLOOKUP(A434,[2]Ledenlijst!$B$2:$N$707,7,FALSE)","v":"S"}]
[7315,{"$f":"VLOOKUP(A435,[2]Ledenlijst!$B$2:$N$707,2,FALSE)","v":"EVERAERDT Corneel"},{"$f":"VLOOKUP(A435,[2]Ledenlijst!$B$2:$N$707,13,FALSE)","v":"WOH"},{"$f":"VLOOKUP(A435,[2]Ledenlijst!$B$2:$N$707,7,FALSE)","v":"S"}]
[7316,{"$f":"VLOOKUP(A436,[2]Ledenlijst!$B$2:$N$707,2,FALSE)","v":"RONDELE Freddy"},{"$f":"VLOOKUP(A436,[2]Ledenlijst!$B$2:$N$707,13,FALSE)","v":"WOH"},{"$f":"VLOOKUP(A436,[2]Ledenlijst!$B$2:$N$707,7,FALSE)","v":"S"}]
[9271,{"$f":"VLOOKUP(A437,[2]Ledenlijst!$B$2:$N$707,2,FALSE)","v":"VAN ACKER Frank"},{"$f":"VLOOKUP(A437,[2]Ledenlijst!$B$2:$N$707,13,FALSE)","v":"WOH"},{"$f":"VLOOKUP(A437,[2]Ledenlijst!$B$2:$N$707,7,FALSE)","v":"S"}]
[8528,{"$f":"VLOOKUP(A438,[2]Ledenlijst!$B$2:$N$707,2,FALSE)","v":"VAN ACKER Jozef"},{"$f":"VLOOKUP(A438,[2]Ledenlijst!$B$2:$N$707,13,FALSE)","v":"WOH"},{"$f":"VLOOKUP(A438,[2]Ledenlijst!$B$2:$N$707,7,FALSE)","v":"S"},null,null,{"$f":"COUNTA(A427:A438)","v":12},null,"WOH"]
[4702,{"$f":"VLOOKUP(A439,[2]Ledenlijst!$B$2:$N$707,2,FALSE)","v":"BEGHIN Bernard"},{"$f":"VLOOKUP(A439,[2]Ledenlijst!$B$2:$N$707,13,FALSE)","v":"RT"},{"$f":"VLOOKUP(A439,[2]Ledenlijst!$B$2:$N$707,7,FALSE)","v":"S"}]
[4740,{"$f":"VLOOKUP(A440,[2]Ledenlijst!$B$2:$N$707,2,FALSE)","v":"BEGHIN Julien"},{"$f":"VLOOKUP(A440,[2]Ledenlijst!$B$2:$N$707,13,FALSE)","v":"RT"},{"$f":"VLOOKUP(A440,[2]Ledenlijst!$B$2:$N$707,7,FALSE)","v":"S"}]
[6441,{"$f":"VLOOKUP(A441,[2]Ledenlijst!$B$2:$N$707,2,FALSE)","v":"BERRIER Jean-Pierre"},{"$f":"VLOOKUP(A441,[2]Ledenlijst!$B$2:$N$707,13,FALSE)","v":"RT"},{"$f":"VLOOKUP(A441,[2]Ledenlijst!$B$2:$N$707,7,FALSE)","v":"S"}]
[9077,{"$f":"VLOOKUP(A442,[2]Ledenlijst!$B$2:$N$707,2,FALSE)","v":"COUCKE Gabriel"},{"$f":"VLOOKUP(A442,[2]Ledenlijst!$B$2:$N$707,13,FALSE)","v":"RT"},{"$f":"VLOOKUP(A442,[2]Ledenlijst!$B$2:$N$707,7,FALSE)","v":"S"}]
[9076,{"$f":"VLOOKUP(A443,[2]Ledenlijst!$B$2:$N$707,2,FALSE)","v":"DELPLANQUE Fabien"},{"$f":"VLOOKUP(A443,[2]Ledenlijst!$B$2:$N$707,13,FALSE)","v":"RT"},{"$f":"VLOOKUP(A443,[2]Ledenlijst!$B$2:$N$707,7,FALSE)","v":"S"}]
[4709,{"$f":"VLOOKUP(A444,[2]Ledenlijst!$B$2:$N$707,2,FALSE)","v":"DESBONNEZ Philippe"},{"$f":"VLOOKUP(A444,[2]Ledenlijst!$B$2:$N$707,13,FALSE)","v":"RT"},{"$f":"VLOOKUP(A444,[2]Ledenlijst!$B$2:$N$707,7,FALSE)","v":"S"}]
[9528,{"$f":"VLOOKUP(A445,[2]Ledenlijst!$B$2:$N$707,2,FALSE)","v":"DE SOUSA Joaquim"},{"$f":"VLOOKUP(A445,[2]Ledenlijst!$B$2:$N$707,13,FALSE)","v":"RT"},{"$f":"VLOOKUP(A445,[2]Ledenlijst!$B$2:$N$707,7,FALSE)","v":"S"}]
[7542,{"$f":"VLOOKUP(A446,[2]Ledenlijst!$B$2:$N$707,2,FALSE)","v":"DESTAILLEUR Patrick"},{"$f":"VLOOKUP(A446,[2]Ledenlijst!$B$2:$N$707,13,FALSE)","v":"RT"},{"$f":"VLOOKUP(A446,[2]Ledenlijst!$B$2:$N$707,7,FALSE)","v":"S"}]
[9971,{"$f":"VLOOKUP(A447,[2]Ledenlijst!$B$2:$N$707,2,FALSE)","v":"DUEZ Bernard"},{"$f":"VLOOKUP(A447,[2]Ledenlijst!$B$2:$N$707,13,FALSE)","v":"RT"},{"$f":"VLOOKUP(A447,[2]Ledenlijst!$B$2:$N$707,7,FALSE)","v":"S"}]
[4710,{"$f":"VLOOKUP(A448,[2]Ledenlijst!$B$2:$N$707,2,FALSE)","v":"EQUIPART Pierre"},{"$f":"VLOOKUP(A448,[2]Ledenlijst!$B$2:$N$707,13,FALSE)","v":"RT"},{"$f":"VLOOKUP(A448,[2]Ledenlijst!$B$2:$N$707,7,FALSE)","v":"S"}]
[9075,{"$f":"VLOOKUP(A449,[2]Ledenlijst!$B$2:$N$707,2,FALSE)","v":"FLORIN Marc"},{"$f":"VLOOKUP(A449,[2]Ledenlijst!$B$2:$N$707,13,FALSE)","v":"RT"},{"$f":"VLOOKUP(A449,[2]Ledenlijst!$B$2:$N$707,7,FALSE)","v":"S"}]
[9272,{"$f":"VLOOKUP(A450,[2]Ledenlijst!$B$2:$N$707,2,FALSE)","v":"GUENEZ Christophe"},{"$f":"VLOOKUP(A450,[2]Ledenlijst!$B$2:$N$707,13,FALSE)","v":"RT"},{"$f":"VLOOKUP(A450,[2]Ledenlijst!$B$2:$N$707,7,FALSE)","v":"S"}]
[4715,{"$f":"VLOOKUP(A451,[2]Ledenlijst!$B$2:$N$707,2,FALSE)","v":"LAMPE Guy"},{"$f":"VLOOKUP(A451,[2]Ledenlijst!$B$2:$N$707,13,FALSE)","v":"RT"},{"$f":"VLOOKUP(A451,[2]Ledenlijst!$B$2:$N$707,7,FALSE)","v":"S"}]
[4714,{"$f":"VLOOKUP(A452,[2]Ledenlijst!$B$2:$N$707,2,FALSE)","v":"LAMOTE Francis"},{"$f":"VLOOKUP(A452,[2]Ledenlijst!$B$2:$N$707,13,FALSE)","v":"RT"},{"$f":"VLOOKUP(A452,[2]Ledenlijst!$B$2:$N$707,7,FALSE)","v":"S"}]
[8694,{"$f":"VLOOKUP(A453,[2]Ledenlijst!$B$2:$N$707,2,FALSE)","v":"VANDEMAELE Paul-André"},{"$f":"VLOOKUP(A453,[2]Ledenlijst!$B$2:$N$707,13,FALSE)","v":"RT"},{"$f":"VLOOKUP(A453,[2]Ledenlijst!$B$2:$N$707,7,FALSE)","v":"S"}]
[9435,{"$f":"VLOOKUP(A454,[2]Ledenlijst!$B$2:$N$707,2,FALSE)","v":"VERCAMPST Rémy"},{"$f":"VLOOKUP(A454,[2]Ledenlijst!$B$2:$N$707,13,FALSE)","v":"RT"},null,{"$f":"VLOOKUP(A454,[2]Ledenlijst!$B$2:$N$707,7,FALSE)","v":"J"},null,{"$f":"COUNTA(A439:A454)","v":16},null,"RT"]
[4703,{"$f":"VLOOKUP(A455,[2]Ledenlijst!$B$2:$N$707,2,FALSE)","v":"BEGHIN Frédéric"},{"$f":"VLOOKUP(A455,[2]Ledenlijst!$B$2:$N$707,13,FALSE)","v":"KK"},{"$f":"VLOOKUP(A455,[2]Ledenlijst!$B$2:$N$707,7,FALSE)","v":"S"}]
[9078,{"$f":"VLOOKUP(A456,[2]Ledenlijst!$B$2:$N$707,2,FALSE)","v":"BEKAERT Bernhard"},{"$f":"VLOOKUP(A456,[2]Ledenlijst!$B$2:$N$707,13,FALSE)","v":"KK"},{"$f":"VLOOKUP(A456,[2]Ledenlijst!$B$2:$N$707,7,FALSE)","v":"S"}]
[5809,{"$f":"VLOOKUP(A457,[2]Ledenlijst!$B$2:$N$707,2,FALSE)","v":"BITALIS Richard"},{"$f":"VLOOKUP(A457,[2]Ledenlijst!$B$2:$N$707,13,FALSE)","v":"KK"},{"$f":"VLOOKUP(A457,[2]Ledenlijst!$B$2:$N$707,7,FALSE)","v":"S"}]
[1150,{"$f":"VLOOKUP(A458,[2]Ledenlijst!$B$2:$N$707,2,FALSE)","v":"BRANTS Ronny"},{"$f":"VLOOKUP(A458,[2]Ledenlijst!$B$2:$N$707,13,FALSE)","v":"KK"},{"$f":"VLOOKUP(A458,[2]Ledenlijst!$B$2:$N$707,7,FALSE)","v":"S"}]
[9968,{"$f":"VLOOKUP(A459,[2]Ledenlijst!$B$2:$N$707,2,FALSE)","v":"BRUYERE Michel"},{"$f":"VLOOKUP(A459,[2]Ledenlijst!$B$2:$N$707,13,FALSE)","v":"KK"},{"$f":"VLOOKUP(A459,[2]Ledenlijst!$B$2:$N$707,7,FALSE)","v":"S"}]
[3508,{"$f":"VLOOKUP(A460,[2]Ledenlijst!$B$2:$N$707,2,FALSE)","v":"BUYLE Stany"},{"$f":"VLOOKUP(A460,[2]Ledenlijst!$B$2:$N$707,13,FALSE)","v":"KK"},{"$f":"VLOOKUP(A460,[2]Ledenlijst!$B$2:$N$707,7,FALSE)","v":"S"}]
[1059,{"$f":"VLOOKUP(A461,[2]Ledenlijst!$B$2:$N$707,2,FALSE)","v":"CARDON Eddy"},{"$f":"VLOOKUP(A461,[2]Ledenlijst!$B$2:$N$707,13,FALSE)","v":"KK"},{"$f":"VLOOKUP(A461,[2]Ledenlijst!$B$2:$N$707,7,FALSE)","v":"S"}]
[7457,{"$f":"VLOOKUP(A462,[2]Ledenlijst!$B$2:$N$707,2,FALSE)","v":"COECK Bjorn"},{"$f":"VLOOKUP(A462,[2]Ledenlijst!$B$2:$N$707,13,FALSE)","v":"KK"},{"$f":"VLOOKUP(A462,[2]Ledenlijst!$B$2:$N$707,7,FALSE)","v":"S"}]
[2568,{"$f":"VLOOKUP(A463,[2]Ledenlijst!$B$2:$N$707,2,FALSE)","v":"CORNELISSEN Jacky"},{"$f":"VLOOKUP(A463,[2]Ledenlijst!$B$2:$N$707,13,FALSE)","v":"KK"},{"$f":"VLOOKUP(A463,[2]Ledenlijst!$B$2:$N$707,7,FALSE)","v":"S"}]
[1054,{"$f":"VLOOKUP(A464,[2]Ledenlijst!$B$2:$N$707,2,FALSE)","v":"DEMOS Georges"},{"$f":"VLOOKUP(A464,[2]Ledenlijst!$B$2:$N$707,13,FALSE)","v":"KK"},{"$f":"VLOOKUP(A464,[2]Ledenlijst!$B$2:$N$707,7,FALSE)","v":"S"}]
[6727,{"$f":"VLOOKUP(A465,[2]Ledenlijst!$B$2:$N$707,2,FALSE)","v":"DE RYNCK Ivan"},{"$f":"VLOOKUP(A465,[2]Ledenlijst!$B$2:$N$707,13,FALSE)","v":"KK"},{"$f":"VLOOKUP(A465,[2]Ledenlijst!$B$2:$N$707,7,FALSE)","v":"S"}]
[4708,{"$f":"VLOOKUP(A466,[2]Ledenlijst!$B$2:$N$707,2,FALSE)","v":"DENNEULIN Frédéric"},{"$f":"VLOOKUP(A466,[2]Ledenlijst!$B$2:$N$707,13,FALSE)","v":"KK"},{"$f":"VLOOKUP(A466,[2]Ledenlijst!$B$2:$N$707,7,FALSE)","v":"S"}]
[6730,{"$f":"VLOOKUP(A467,[2]Ledenlijst!$B$2:$N$707,2,FALSE)","v":"DENOULET Johan"},{"$f":"VLOOKUP(A467,[2]Ledenlijst!$B$2:$N$707,13,FALSE)","v":"KK"},{"$f":"VLOOKUP(A467,[2]Ledenlijst!$B$2:$N$707,7,FALSE)","v":"S"}]
[5223,{"$f":"VLOOKUP(A468,[2]Ledenlijst!$B$2:$N$707,2,FALSE)","v":"DESCHEPPER Carl"},{"$f":"VLOOKUP(A468,[2]Ledenlijst!$B$2:$N$707,13,FALSE)","v":"KK"},{"$f":"VLOOKUP(A468,[2]Ledenlijst!$B$2:$N$707,7,FALSE)","v":"S"}]
[1053,{"$f":"VLOOKUP(A469,[2]Ledenlijst!$B$2:$N$707,2,FALSE)","v":"DESPREZ Jean-Pierre"},{"$f":"VLOOKUP(A469,[2]Ledenlijst!$B$2:$N$707,13,FALSE)","v":"KK"},{"$f":"VLOOKUP(A469,[2]Ledenlijst!$B$2:$N$707,7,FALSE)","v":"S"}]
["00696",{"$f":"VLOOKUP(A470,[2]Ledenlijst!$B$2:$N$707,2,FALSE)","v":"DEVOLDERE Eric"},{"$f":"VLOOKUP(A470,[2]Ledenlijst!$B$2:$N$707,13,FALSE)","v":"KK"},null,null,{"$f":"VLOOKUP(A470,[2]Ledenlijst!$B$2:$N$707,7,FALSE)","v":"K"}]
[8696,{"$f":"VLOOKUP(A471,[2]Ledenlijst!$B$2:$N$707,2,FALSE)","v":"DORARD Steve"},{"$f":"VLOOKUP(A471,[2]Ledenlijst!$B$2:$N$707,13,FALSE)","v":"KK"},{"$f":"VLOOKUP(A471,[2]Ledenlijst!$B$2:$N$707,7,FALSE)","v":"S"}]
[4589,{"$f":"VLOOKUP(A472,[2]Ledenlijst!$B$2:$N$707,2,FALSE)","v":"GODEFROIDT Frédéric"},{"$f":"VLOOKUP(A472,[2]Ledenlijst!$B$2:$N$707,13,FALSE)","v":"KK"},{"$f":"VLOOKUP(A472,[2]Ledenlijst!$B$2:$N$707,7,FALSE)","v":"S"}]
["00248",{"$f":"VLOOKUP(A473,[2]Ledenlijst!$B$2:$N$707,2,FALSE)","v":"HUYSENTRUYT Eric"},{"$f":"VLOOKUP(A473,[2]Ledenlijst!$B$2:$N$707,13,FALSE)","v":"KK"},null,null,{"$f":"VLOOKUP(A473,[2]Ledenlijst!$B$2:$N$707,7,FALSE)","v":"K"}]
[4730,{"$f":"VLOOKUP(A474,[2]Ledenlijst!$B$2:$N$707,2,FALSE)","v":"LAGAGE Roger"},{"$f":"VLOOKUP(A474,[2]Ledenlijst!$B$2:$N$707,13,FALSE)","v":"KK"},{"$f":"VLOOKUP(A474,[2]Ledenlijst!$B$2:$N$707,7,FALSE)","v":"S"}]
[8714,{"$f":"VLOOKUP(A475,[2]Ledenlijst!$B$2:$N$707,2,FALSE)","v":"LOOSVELDT Frank"},{"$f":"VLOOKUP(A475,[2]Ledenlijst!$B$2:$N$707,13,FALSE)","v":"KK"},{"$f":"VLOOKUP(A475,[2]Ledenlijst!$B$2:$N$707,7,FALSE)","v":"S"}]
["00401",{"$f":"VLOOKUP(A476,[2]Ledenlijst!$B$2:$N$707,2,FALSE)","v":"MALESIS Pierre"},{"$f":"VLOOKUP(A476,[2]Ledenlijst!$B$2:$N$707,13,FALSE)","v":"KK"},null,null,{"$f":"VLOOKUP(A476,[2]Ledenlijst!$B$2:$N$707,7,FALSE)","v":"K"}]
[8425,{"$f":"VLOOKUP(A477,[2]Ledenlijst!$B$2:$N$707,2,FALSE)","v":"MILLET Michel"},{"$f":"VLOOKUP(A477,[2]Ledenlijst!$B$2:$N$707,13,FALSE)","v":"KK"},{"$f":"VLOOKUP(A477,[2]Ledenlijst!$B$2:$N$707,7,FALSE)","v":"S"}]
[8159,{"$f":"VLOOKUP(A478,[2]Ledenlijst!$B$2:$N$707,2,FALSE)","v":"MONSOREZ Michel"},{"$f":"VLOOKUP(A478,[2]Ledenlijst!$B$2:$N$707,13,FALSE)","v":"KK"},{"$f":"VLOOKUP(A478,[2]Ledenlijst!$B$2:$N$707,7,FALSE)","v":"S"}]
[4680,{"$f":"VLOOKUP(A479,[2]Ledenlijst!$B$2:$N$707,2,FALSE)","v":"RAVESTIJN Martin"},{"$f":"VLOOKUP(A479,[2]Ledenlijst!$B$2:$N$707,13,FALSE)","v":"KK"},{"$f":"VLOOKUP(A479,[2]Ledenlijst!$B$2:$N$707,7,FALSE)","v":"S"}]
[7129,{"$f":"VLOOKUP(A480,[2]Ledenlijst!$B$2:$N$707,2,FALSE)","v":"ROELANTS Frédéric"},{"$f":"VLOOKUP(A480,[2]Ledenlijst!$B$2:$N$707,13,FALSE)","v":"KK"},{"$f":"VLOOKUP(A480,[2]Ledenlijst!$B$2:$N$707,7,FALSE)","v":"S"}]
[4736,{"$f":"VLOOKUP(A481,[2]Ledenlijst!$B$2:$N$707,2,FALSE)","v":"VAN COILLIE Francky"},{"$f":"VLOOKUP(A481,[2]Ledenlijst!$B$2:$N$707,13,FALSE)","v":"KK"},{"$f":"VLOOKUP(A481,[2]Ledenlijst!$B$2:$N$707,7,FALSE)","v":"S"}]
["00360",{"$f":"VLOOKUP(A482,[2]Ledenlijst!$B$2:$N$707,2,FALSE)","v":"VANDAELE Eric"},{"$f":"VLOOKUP(A482,[2]Ledenlijst!$B$2:$N$707,13,FALSE)","v":"KK"},null,null,{"$f":"VLOOKUP(A482,[2]Ledenlijst!$B$2:$N$707,7,FALSE)","v":"K"}]
[8480,{"$f":"VLOOKUP(A483,[2]Ledenlijst!$B$2:$N$707,2,FALSE)","v":"VANGANSBEKE Gerard"},{"$f":"VLOOKUP(A483,[2]Ledenlijst!$B$2:$N$707,13,FALSE)","v":"KK"},{"$f":"VLOOKUP(A483,[2]Ledenlijst!$B$2:$N$707,7,FALSE)","v":"S"}]
[4737,{"$f":"VLOOKUP(A484,[2]Ledenlijst!$B$2:$N$707,2,FALSE)","v":"VANGANSBEKE Luc"},{"$f":"VLOOKUP(A484,[2]Ledenlijst!$B$2:$N$707,13,FALSE)","v":"KK"},{"$f":"VLOOKUP(A484,[2]Ledenlijst!$B$2:$N$707,7,FALSE)","v":"S"}]
[4725,{"$f":"VLOOKUP(A485,[2]Ledenlijst!$B$2:$N$707,2,FALSE)","v":"VANONACKER Patrick"},{"$f":"VLOOKUP(A485,[2]Ledenlijst!$B$2:$N$707,13,FALSE)","v":"KK"},{"$f":"VLOOKUP(A485,[2]Ledenlijst!$B$2:$N$707,7,FALSE)","v":"S"}]
[4798,{"$f":"VLOOKUP(A486,[2]Ledenlijst!$B$2:$N$707,2,FALSE)","v":"VERCOUILLIE Alexander"},{"$f":"VLOOKUP(A486,[2]Ledenlijst!$B$2:$N$707,13,FALSE)","v":"KK"},{"$f":"VLOOKUP(A486,[2]Ledenlijst!$B$2:$N$707,7,FALSE)","v":"S"}]
[4799,{"$f":"VLOOKUP(A487,[2]Ledenlijst!$B$2:$N$707,2,FALSE)","v":"VERCOUILLIE José"},{"$f":"VLOOKUP(A487,[2]Ledenlijst!$B$2:$N$707,13,FALSE)","v":"KK"},{"$f":"VLOOKUP(A487,[2]Ledenlijst!$B$2:$N$707,7,FALSE)","v":"S"}]
[8089,{"$f":"VLOOKUP(A488,[2]Ledenlijst!$B$2:$N$707,2,FALSE)","v":"VERGHEYNST Albert"},{"$f":"VLOOKUP(A488,[2]Ledenlijst!$B$2:$N$707,13,FALSE)","v":"KK"},{"$f":"VLOOKUP(A488,[2]Ledenlijst!$B$2:$N$707,7,FALSE)","v":"S"},null,null,{"$f":"COUNTA(A455:A488)","v":34},null,"KK"]
[9439,{"$f":"VLOOKUP(A489,[2]Ledenlijst!$B$2:$N$707,2,FALSE)","v":"VANDENBERGHE Rudy"},{"$f":"VLOOKUP(A489,[2]Ledenlijst!$B$2:$N$707,13,FALSE)","v":"VOLH"},{"$f":"VLOOKUP(A489,[2]Ledenlijst!$B$2:$N$707,7,FALSE)","v":"S"}]
[8735,{"$f":"VLOOKUP(A490,[2]Ledenlijst!$B$2:$N$707,2,FALSE)","v":"VAN DEN BUVERIE Eric"},{"$f":"VLOOKUP(A490,[2]Ledenlijst!$B$2:$N$707,13,FALSE)","v":"VOLH"},{"$f":"VLOOKUP(A490,[2]Ledenlijst!$B$2:$N$707,7,FALSE)","v":"S"},null,null,{"$f":"COUNTA(A489:A490)","v":2},null,"VR"]
[1055,{"$f":"VLOOKUP(A491,[2]Ledenlijst!$B$2:$N$707,2,FALSE)","v":"BRUWIER Erwin"},{"$f":"VLOOKUP(A491,[2]Ledenlijst!$B$2:$N$707,13,FALSE)","v":"DOS"},{"$f":"VLOOKUP(A491,[2]Ledenlijst!$B$2:$N$707,7,FALSE)","v":"S"}]
[9957,{"$f":"VLOOKUP(A492,[2]Ledenlijst!$B$2:$N$707,2,FALSE)","v":"BRUWIER Ludwin"},{"$f":"VLOOKUP(A492,[2]Ledenlijst!$B$2:$N$707,13,FALSE)","v":"DOS"},{"$f":"VLOOKUP(A492,[2]Ledenlijst!$B$2:$N$707,7,FALSE)","v":"S"}]
[4762,{"$f":"VLOOKUP(A493,[2]Ledenlijst!$B$2:$N$707,2,FALSE)","v":"CASTELEYN Henk"},{"$f":"VLOOKUP(A493,[2]Ledenlijst!$B$2:$N$707,13,FALSE)","v":"DOS"},{"$f":"VLOOKUP(A493,[2]Ledenlijst!$B$2:$N$707,7,FALSE)","v":"S"}]
[4765,{"$f":"VLOOKUP(A494,[2]Ledenlijst!$B$2:$N$707,2,FALSE)","v":"DEBAES Peter"},{"$f":"VLOOKUP(A494,[2]Ledenlijst!$B$2:$N$707,13,FALSE)","v":"DOS"},{"$f":"VLOOKUP(A494,[2]Ledenlijst!$B$2:$N$707,7,FALSE)","v":"S"}]
[9958,{"$f":"VLOOKUP(A495,[2]Ledenlijst!$B$2:$N$707,2,FALSE)","v":"DEBLAUWE Dimiitri"},{"$f":"VLOOKUP(A495,[2]Ledenlijst!$B$2:$N$707,13,FALSE)","v":"DOS"},{"$f":"VLOOKUP(A495,[2]Ledenlijst!$B$2:$N$707,7,FALSE)","v":"S"}]
[4666,{"$f":"VLOOKUP(A496,[2]Ledenlijst!$B$2:$N$707,2,FALSE)","v":"DECONINCK Franky"},{"$f":"VLOOKUP(A496,[2]Ledenlijst!$B$2:$N$707,13,FALSE)","v":"DOS"},{"$f":"VLOOKUP(A496,[2]Ledenlijst!$B$2:$N$707,7,FALSE)","v":"S"}]
[4768,{"$f":"VLOOKUP(A497,[2]Ledenlijst!$B$2:$N$707,2,FALSE)","v":"DEDIER Georges"},{"$f":"VLOOKUP(A497,[2]Ledenlijst!$B$2:$N$707,13,FALSE)","v":"DOS"},{"$f":"VLOOKUP(A497,[2]Ledenlijst!$B$2:$N$707,7,FALSE)","v":"S"}]
[8156,{"$f":"VLOOKUP(A498,[2]Ledenlijst!$B$2:$N$707,2,FALSE)","v":"DETOLLENAERE Jonny"},{"$f":"VLOOKUP(A498,[2]Ledenlijst!$B$2:$N$707,13,FALSE)","v":"DOS"},{"$f":"VLOOKUP(A498,[2]Ledenlijst!$B$2:$N$707,7,FALSE)","v":"S"}]
["00649",{"$f":"VLOOKUP(A499,[2]Ledenlijst!$B$2:$N$707,2,FALSE)","v":"DUTRY LUC"},{"$f":"VLOOKUP(A499,[2]Ledenlijst!$B$2:$N$707,13,FALSE)","v":"DOS"},null,null,{"$f":"VLOOKUP(A499,[2]Ledenlijst!$B$2:$N$707,7,FALSE)","v":"K"}]
[4774,{"$f":"VLOOKUP(A500,[2]Ledenlijst!$B$2:$N$707,2,FALSE)","v":"DUYCK Peter"},{"$f":"VLOOKUP(A500,[2]Ledenlijst!$B$2:$N$707,13,FALSE)","v":"DOS"},{"$f":"VLOOKUP(A500,[2]Ledenlijst!$B$2:$N$707,7,FALSE)","v":"S"}]
[1061,{"$f":"VLOOKUP(A501,[2]Ledenlijst!$B$2:$N$707,2,FALSE)","v":"GELDHOF Frank"},{"$f":"VLOOKUP(A501,[2]Ledenlijst!$B$2:$N$707,13,FALSE)","v":"DOS"},null,null,{"$f":"VLOOKUP(A501,[2]Ledenlijst!$B$2:$N$707,7,FALSE)","v":"K"}]
[7697,{"$f":"VLOOKUP(A502,[2]Ledenlijst!$B$2:$N$707,2,FALSE)","v":"GHESQUIERE Jozef"},{"$f":"VLOOKUP(A502,[2]Ledenlijst!$B$2:$N$707,13,FALSE)","v":"DOS"},{"$f":"VLOOKUP(A502,[2]Ledenlijst!$B$2:$N$707,7,FALSE)","v":"S"}]
[9018,{"$f":"VLOOKUP(A503,[2]Ledenlijst!$B$2:$N$707,2,FALSE)","v":"GHEVART Jean"},{"$f":"VLOOKUP(A503,[2]Ledenlijst!$B$2:$N$707,13,FALSE)","v":"DOS"},{"$f":"VLOOKUP(A503,[2]Ledenlijst!$B$2:$N$707,7,FALSE)","v":"S"}]
[4776,{"$f":"VLOOKUP(A504,[2]Ledenlijst!$B$2:$N$707,2,FALSE)","v":"HOUTHAEVE Jean-Marie"},{"$f":"VLOOKUP(A504,[2]Ledenlijst!$B$2:$N$707,13,FALSE)","v":"DOS"},{"$f":"VLOOKUP(A504,[2]Ledenlijst!$B$2:$N$707,7,FALSE)","v":"S"}]
["4550B",{"$f":"VLOOKUP(A505,[2]Ledenlijst!$B$2:$N$707,2,FALSE)","v":"KESTELOOT Patrick"},{"$f":"VLOOKUP(A505,[2]Ledenlijst!$B$2:$N$707,13,FALSE)","v":"DOS"},{"$f":"VLOOKUP(A505,[2]Ledenlijst!$B$2:$N$707,7,FALSE)","v":"S"}]
["00645",{"$f":"VLOOKUP(A506,[2]Ledenlijst!$B$2:$N$707,2,FALSE)","v":"LEENKNECHT Bertrand"},{"$f":"VLOOKUP(A506,[2]Ledenlijst!$B$2:$N$707,13,FALSE)","v":"DOS"},null,null,{"$f":"VLOOKUP(A506,[2]Ledenlijst!$B$2:$N$707,7,FALSE)","v":"K"}]
[4778,{"$f":"VLOOKUP(A507,[2]Ledenlijst!$B$2:$N$707,2,FALSE)","v":"LEYN Philippe"},{"$f":"VLOOKUP(A507,[2]Ledenlijst!$B$2:$N$707,13,FALSE)","v":"DOS"},{"$f":"VLOOKUP(A507,[2]Ledenlijst!$B$2:$N$707,7,FALSE)","v":"S"}]
[8697,{"$f":"VLOOKUP(A508,[2]Ledenlijst!$B$2:$N$707,2,FALSE)","v":"MELNYTSCHENKO Cédric"},{"$f":"VLOOKUP(A508,[2]Ledenlijst!$B$2:$N$707,13,FALSE)","v":"DOS"},{"$f":"VLOOKUP(A508,[2]Ledenlijst!$B$2:$N$707,7,FALSE)","v":"S"}]
[4693,{"$f":"VLOOKUP(A509,[2]Ledenlijst!$B$2:$N$707,2,FALSE)","v":"MOSTREY Peter"},{"$f":"VLOOKUP(A509,[2]Ledenlijst!$B$2:$N$707,13,FALSE)","v":"DOS"},{"$f":"VLOOKUP(A509,[2]Ledenlijst!$B$2:$N$707,7,FALSE)","v":"S"}]
[4231,{"$f":"VLOOKUP(A510,[2]Ledenlijst!$B$2:$N$707,2,FALSE)","v":"NOE Christiaan"},{"$f":"VLOOKUP(A510,[2]Ledenlijst!$B$2:$N$707,13,FALSE)","v":"DOS"},{"$f":"VLOOKUP(A510,[2]Ledenlijst!$B$2:$N$707,7,FALSE)","v":"S"}]
[4733,{"$f":"VLOOKUP(A511,[2]Ledenlijst!$B$2:$N$707,2,FALSE)","v":"NUYTTENS Gino"},{"$f":"VLOOKUP(A511,[2]Ledenlijst!$B$2:$N$707,13,FALSE)","v":"DOS"},{"$f":"VLOOKUP(A511,[2]Ledenlijst!$B$2:$N$707,7,FALSE)","v":"S"}]
["00650",{"$f":"VLOOKUP(A512,[2]Ledenlijst!$B$2:$N$707,2,FALSE)","v":"ONBEKENT Michel"},{"$f":"VLOOKUP(A512,[2]Ledenlijst!$B$2:$N$707,13,FALSE)","v":"DOS"},null,null,{"$f":"VLOOKUP(A512,[2]Ledenlijst!$B$2:$N$707,7,FALSE)","v":"K"}]
["00648",{"$f":"VLOOKUP(A513,[2]Ledenlijst!$B$2:$N$707,2,FALSE)","v":"PLANCKE Filip"},{"$f":"VLOOKUP(A513,[2]Ledenlijst!$B$2:$N$707,13,FALSE)","v":"DOS"},null,null,{"$f":"VLOOKUP(A513,[2]Ledenlijst!$B$2:$N$707,7,FALSE)","v":"K"}]
[8705,{"$f":"VLOOKUP(A514,[2]Ledenlijst!$B$2:$N$707,2,FALSE)","v":"STEVENS Ilse"},{"$f":"VLOOKUP(A514,[2]Ledenlijst!$B$2:$N$707,13,FALSE)","v":"DOS"},{"$f":"VLOOKUP(A514,[2]Ledenlijst!$B$2:$N$707,7,FALSE)","v":"S"}]
[4738,{"$f":"VLOOKUP(A515,[2]Ledenlijst!$B$2:$N$707,2,FALSE)","v":"VANDENDRIESSCHE Philippe"},{"$f":"VLOOKUP(A515,[2]Ledenlijst!$B$2:$N$707,13,FALSE)","v":"DOS"},{"$f":"VLOOKUP(A515,[2]Ledenlijst!$B$2:$N$707,7,FALSE)","v":"S"}]
[8090,{"$f":"VLOOKUP(A516,[2]Ledenlijst!$B$2:$N$707,2,FALSE)","v":"VANLAUWE Stephan"},{"$f":"VLOOKUP(A516,[2]Ledenlijst!$B$2:$N$707,13,FALSE)","v":"DOS"},{"$f":"VLOOKUP(A516,[2]Ledenlijst!$B$2:$N$707,7,FALSE)","v":"S"}]
[2299,{"$f":"VLOOKUP(A517,[2]Ledenlijst!$B$2:$N$707,2,FALSE)","v":"VANTHOURNOUT Michel"},{"$f":"VLOOKUP(A517,[2]Ledenlijst!$B$2:$N$707,13,FALSE)","v":"DOS"},{"$f":"VLOOKUP(A517,[2]Ledenlijst!$B$2:$N$707,7,FALSE)","v":"S"}]
[9045,{"$f":"VLOOKUP(A518,[2]Ledenlijst!$B$2:$N$707,2,FALSE)","v":"WALLART Jean-Charles"},{"$f":"VLOOKUP(A518,[2]Ledenlijst!$B$2:$N$707,13,FALSE)","v":"DOS"},{"$f":"VLOOKUP(A518,[2]Ledenlijst!$B$2:$N$707,7,FALSE)","v":"S"}]
[4759,{"$f":"VLOOKUP(A519,[2]Ledenlijst!$B$2:$N$707,2,FALSE)","v":"WARLOP Luc"},{"$f":"VLOOKUP(A519,[2]Ledenlijst!$B$2:$N$707,13,FALSE)","v":"DOS"},{"$f":"VLOOKUP(A519,[2]Ledenlijst!$B$2:$N$707,7,FALSE)","v":"S"}]
[6720,{"$f":"VLOOKUP(A520,[2]Ledenlijst!$B$2:$N$707,2,FALSE)","v":"WILLE Etienne"},{"$f":"VLOOKUP(A520,[2]Ledenlijst!$B$2:$N$707,13,FALSE)","v":"DOS"},{"$f":"VLOOKUP(A520,[2]Ledenlijst!$B$2:$N$707,7,FALSE)","v":"S"}]
[1060,{"$f":"VLOOKUP(A521,[2]Ledenlijst!$B$2:$N$707,2,FALSE)","v":"WITTEVRONGEL Dirk"},{"$f":"VLOOKUP(A521,[2]Ledenlijst!$B$2:$N$707,13,FALSE)","v":"DOS"},{"$f":"VLOOKUP(A521,[2]Ledenlijst!$B$2:$N$707,7,FALSE)","v":"S"},null,null,{"$f":"COUNTA(A491:A521)","v":31},null,"DOS"]
[4659,{"$f":"VLOOKUP(A522,[2]Ledenlijst!$B$2:$N$707,2,FALSE)","v":"BAS Jacques"},{"$f":"VLOOKUP(A522,[2]Ledenlijst!$B$2:$N$707,13,FALSE)","v":"K.GHOK"},{"$f":"VLOOKUP(A522,[2]Ledenlijst!$B$2:$N$707,7,FALSE)","v":"S"}]
["00785",{"$f":"VLOOKUP(A523,[2]Ledenlijst!$B$2:$N$707,2,FALSE)","v":"BOONAERT André"},{"$f":"VLOOKUP(A523,[2]Ledenlijst!$B$2:$N$707,13,FALSE)","v":"K.GHOK"},null,null,{"$f":"VLOOKUP(A523,[2]Ledenlijst!$B$2:$N$707,7,FALSE)","v":"K"}]
[7689,{"$f":"VLOOKUP(A524,[2]Ledenlijst!$B$2:$N$707,2,FALSE)","v":"BOSSAERT Dirk"},{"$f":"VLOOKUP(A524,[2]Ledenlijst!$B$2:$N$707,13,FALSE)","v":"K.GHOK"},{"$f":"VLOOKUP(A524,[2]Ledenlijst!$B$2:$N$707,7,FALSE)","v":"S"}]
["00786",{"$f":"VLOOKUP(A525,[2]Ledenlijst!$B$2:$N$707,2,FALSE)","v":"BOSSUYT Eddy"},{"$f":"VLOOKUP(A525,[2]Ledenlijst!$B$2:$N$707,13,FALSE)","v":"K.GHOK"},null,null,{"$f":"VLOOKUP(A525,[2]Ledenlijst!$B$2:$N$707,7,FALSE)","v":"K"}]
[9529,{"$f":"VLOOKUP(A526,[2]Ledenlijst!$B$2:$N$707,2,FALSE)","v":"CALLAERT Alain"},{"$f":"VLOOKUP(A526,[2]Ledenlijst!$B$2:$N$707,13,FALSE)","v":"K.GHOK"},{"$f":"VLOOKUP(A526,[2]Ledenlijst!$B$2:$N$707,7,FALSE)","v":"S"}]
[4789,{"$f":"VLOOKUP(A527,[2]Ledenlijst!$B$2:$N$707,2,FALSE)","v":"CAPPELLE Herwig"},{"$f":"VLOOKUP(A527,[2]Ledenlijst!$B$2:$N$707,13,FALSE)","v":"K.GHOK"},{"$f":"VLOOKUP(A527,[2]Ledenlijst!$B$2:$N$707,7,FALSE)","v":"S"}]
[7308,{"$f":"VLOOKUP(A528,[2]Ledenlijst!$B$2:$N$707,2,FALSE)","v":"CLAUS Gino"},{"$f":"VLOOKUP(A528,[2]Ledenlijst!$B$2:$N$707,13,FALSE)","v":"K.GHOK"},{"$f":"VLOOKUP(A528,[2]Ledenlijst!$B$2:$N$707,7,FALSE)","v":"S"}]
[8688,{"$f":"VLOOKUP(A529,[2]Ledenlijst!$B$2:$N$707,2,FALSE)","v":"DECEUNINCK Kurt"},{"$f":"VLOOKUP(A529,[2]Ledenlijst!$B$2:$N$707,13,FALSE)","v":"K.GHOK"},{"$f":"VLOOKUP(A529,[2]Ledenlijst!$B$2:$N$707,7,FALSE)","v":"S"}]
[8513,{"$f":"VLOOKUP(A530,[2]Ledenlijst!$B$2:$N$707,2,FALSE)","v":"DECOCK Johan"},{"$f":"VLOOKUP(A530,[2]Ledenlijst!$B$2:$N$707,13,FALSE)","v":"K.GHOK"},{"$f":"VLOOKUP(A530,[2]Ledenlijst!$B$2:$N$707,7,FALSE)","v":"S"}]
[9440,{"$f":"VLOOKUP(A531,[2]Ledenlijst!$B$2:$N$707,2,FALSE)","v":"DECOCK Stephan"},{"$f":"VLOOKUP(A531,[2]Ledenlijst!$B$2:$N$707,13,FALSE)","v":"K.GHOK"},{"$f":"VLOOKUP(A531,[2]Ledenlijst!$B$2:$N$707,7,FALSE)","v":"S"}]
[9437,{"$f":"VLOOKUP(A532,[2]Ledenlijst!$B$2:$N$707,2,FALSE)","v":"DHAEYER Rémy"},{"$f":"VLOOKUP(A532,[2]Ledenlijst!$B$2:$N$707,13,FALSE)","v":"K.GHOK"},null,{"$f":"VLOOKUP(A532,[2]Ledenlijst!$B$2:$N$707,7,FALSE)","v":"J"}]
["00787",{"$f":"VLOOKUP(A533,[2]Ledenlijst!$B$2:$N$707,2,FALSE)","v":"DEKEUCKELAERE Patrick"},{"$f":"VLOOKUP(A533,[2]Ledenlijst!$B$2:$N$707,13,FALSE)","v":"K.GHOK"},null,null,{"$f":"VLOOKUP(A533,[2]Ledenlijst!$B$2:$N$707,7,FALSE)","v":"K"}]
["00788",{"$f":"VLOOKUP(A534,[2]Ledenlijst!$B$2:$N$707,2,FALSE)","v":"DELAERE Kevin"},{"$f":"VLOOKUP(A534,[2]Ledenlijst!$B$2:$N$707,13,FALSE)","v":"K.GHOK"},null,null,{"$f":"VLOOKUP(A534,[2]Ledenlijst!$B$2:$N$707,7,FALSE)","v":"K"}]
["00789",{"$f":"VLOOKUP(A535,[2]Ledenlijst!$B$2:$N$707,2,FALSE)","v":"DELOBEL Rik"},{"$f":"VLOOKUP(A535,[2]Ledenlijst!$B$2:$N$707,13,FALSE)","v":"K.GHOK"},null,null,{"$f":"VLOOKUP(A535,[2]Ledenlijst!$B$2:$N$707,7,FALSE)","v":"K"}]
[9855,"CARDOEN Kurt","K.GHOK"]
["00790",{"$f":"VLOOKUP(A537,[2]Ledenlijst!$B$2:$N$707,2,FALSE)","v":"DELVA Johan"},{"$f":"VLOOKUP(A537,[2]Ledenlijst!$B$2:$N$707,13,FALSE)","v":"K.GHOK"},null,null,{"$f":"VLOOKUP(A537,[2]Ledenlijst!$B$2:$N$707,7,FALSE)","v":"K"}]
[4790,{"$f":"VLOOKUP(A538,[2]Ledenlijst!$B$2:$N$707,2,FALSE)","v":"DE MOOR Frederik"},{"$f":"VLOOKUP(A538,[2]Ledenlijst!$B$2:$N$707,13,FALSE)","v":"K.GHOK"},{"$f":"VLOOKUP(A538,[2]Ledenlijst!$B$2:$N$707,7,FALSE)","v":"S"}]
[4791,{"$f":"VLOOKUP(A539,[2]Ledenlijst!$B$2:$N$707,2,FALSE)","v":"DE MOOR Willy"},{"$f":"VLOOKUP(A539,[2]Ledenlijst!$B$2:$N$707,13,FALSE)","v":"K.GHOK"},{"$f":"VLOOKUP(A539,[2]Ledenlijst!$B$2:$N$707,7,FALSE)","v":"S"}]
[9143,{"$f":"VLOOKUP(A540,[2]Ledenlijst!$B$2:$N$707,2,FALSE)","v":"DENEUT Johan"},{"$f":"VLOOKUP(A540,[2]Ledenlijst!$B$2:$N$707,13,FALSE)","v":"K.GHOK"},{"$f":"VLOOKUP(A540,[2]Ledenlijst!$B$2:$N$707,7,FALSE)","v":"S"}]
[4793,{"$f":"VLOOKUP(A541,[2]Ledenlijst!$B$2:$N$707,2,FALSE)","v":"DETAVERNIER Hendrik"},{"$f":"VLOOKUP(A541,[2]Ledenlijst!$B$2:$N$707,13,FALSE)","v":"K.GHOK"},{"$f":"VLOOKUP(A541,[2]Ledenlijst!$B$2:$N$707,7,FALSE)","v":"S"}]
[8873,{"$f":"VLOOKUP(A542,[2]Ledenlijst!$B$2:$N$707,2,FALSE)","v":"DEVOS Claude"},{"$f":"VLOOKUP(A542,[2]Ledenlijst!$B$2:$N$707,13,FALSE)","v":"K.GHOK"},{"$f":"VLOOKUP(A542,[2]Ledenlijst!$B$2:$N$707,7,FALSE)","v":"S"}]
["8047B",{"$f":"VLOOKUP(A543,[2]Ledenlijst!$B$2:$N$707,2,FALSE)","v":"DEVRIENDT Bart"},{"$f":"VLOOKUP(A543,[2]Ledenlijst!$B$2:$N$707,13,FALSE)","v":"K.GHOK"},{"$f":"VLOOKUP(A543,[2]Ledenlijst!$B$2:$N$707,7,FALSE)","v":"S"}]
["00791",{"$f":"VLOOKUP(A544,[2]Ledenlijst!$B$2:$N$707,2,FALSE)","v":"DEWAEGENEERE Ronny"},{"$f":"VLOOKUP(A544,[2]Ledenlijst!$B$2:$N$707,13,FALSE)","v":"K.GHOK"},null,null,{"$f":"VLOOKUP(A544,[2]Ledenlijst!$B$2:$N$707,7,FALSE)","v":"K"}]
[7814,{"$f":"VLOOKUP(A545,[2]Ledenlijst!$B$2:$N$707,2,FALSE)","v":"DEWILDE Johan"},{"$f":"VLOOKUP(A545,[2]Ledenlijst!$B$2:$N$707,13,FALSE)","v":"K.GHOK"},{"$f":"VLOOKUP(A545,[2]Ledenlijst!$B$2:$N$707,7,FALSE)","v":"S"}]
[7458,{"$f":"VLOOKUP(A546,[2]Ledenlijst!$B$2:$N$707,2,FALSE)","v":"DUMON Eddy"},{"$f":"VLOOKUP(A546,[2]Ledenlijst!$B$2:$N$707,13,FALSE)","v":"K.GHOK"},{"$f":"VLOOKUP(A546,[2]Ledenlijst!$B$2:$N$707,7,FALSE)","v":"S"}]
["00793",{"$f":"VLOOKUP(A547,[2]Ledenlijst!$B$2:$N$707,2,FALSE)","v":"GHESQUIERE Eric"},{"$f":"VLOOKUP(A547,[2]Ledenlijst!$B$2:$N$707,13,FALSE)","v":"K.GHOK"},null,null,{"$f":"VLOOKUP(A547,[2]Ledenlijst!$B$2:$N$707,7,FALSE)","v":"K"}]
[4775,{"$f":"VLOOKUP(A548,[2]Ledenlijst!$B$2:$N$707,2,FALSE)","v":"GOETHALS Didier"},{"$f":"VLOOKUP(A548,[2]Ledenlijst!$B$2:$N$707,13,FALSE)","v":"K.GHOK"},{"$f":"VLOOKUP(A548,[2]Ledenlijst!$B$2:$N$707,7,FALSE)","v":"S"}]
[7499,{"$f":"VLOOKUP(A549,[2]Ledenlijst!$B$2:$N$707,2,FALSE)","v":"GRAYE André"},{"$f":"VLOOKUP(A549,[2]Ledenlijst!$B$2:$N$707,13,FALSE)","v":"K.GHOK"},{"$f":"VLOOKUP(A549,[2]Ledenlijst!$B$2:$N$707,7,FALSE)","v":"S"}]
["7461B",{"$f":"VLOOKUP(A550,[2]Ledenlijst!$B$2:$N$707,2,FALSE)","v":"GRIMON Johan"},{"$f":"VLOOKUP(A550,[2]Ledenlijst!$B$2:$N$707,13,FALSE)","v":"K.GHOK"},{"$f":"VLOOKUP(A550,[2]Ledenlijst!$B$2:$N$707,7,FALSE)","v":"S"}]
[9079,{"$f":"VLOOKUP(A551,[2]Ledenlijst!$B$2:$N$707,2,FALSE)","v":"HIMPE Jean"},{"$f":"VLOOKUP(A551,[2]Ledenlijst!$B$2:$N$707,13,FALSE)","v":"K.GHOK"},{"$f":"VLOOKUP(A551,[2]Ledenlijst!$B$2:$N$707,7,FALSE)","v":"S"}]
[9502,{"$f":"VLOOKUP(A552,[2]Ledenlijst!$B$2:$N$707,2,FALSE)","v":"HIMPE Jérémy"},{"$f":"VLOOKUP(A552,[2]Ledenlijst!$B$2:$N$707,13,FALSE)","v":"K.GHOK"},{"$f":"VLOOKUP(A552,[2]Ledenlijst!$B$2:$N$707,7,FALSE)","v":"S"}]
["00794",{"$f":"VLOOKUP(A553,[2]Ledenlijst!$B$2:$N$707,2,FALSE)","v":"HOLVOET Eric"},{"$f":"VLOOKUP(A553,[2]Ledenlijst!$B$2:$N$707,13,FALSE)","v":"K.GHOK"},null,null,{"$f":"VLOOKUP(A553,[2]Ledenlijst!$B$2:$N$707,7,FALSE)","v":"K"}]
[9511,{"$f":"VLOOKUP(A554,[2]Ledenlijst!$B$2:$N$707,2,FALSE)","v":"HOUSSIN Mario"},{"$f":"VLOOKUP(A554,[2]Ledenlijst!$B$2:$N$707,13,FALSE)","v":"K.GHOK"},{"$f":"VLOOKUP(A554,[2]Ledenlijst!$B$2:$N$707,7,FALSE)","v":"S"}]
[7823,{"$f":"VLOOKUP(A555,[2]Ledenlijst!$B$2:$N$707,2,FALSE)","v":"JOYE Robert"},{"$f":"VLOOKUP(A555,[2]Ledenlijst!$B$2:$N$707,13,FALSE)","v":"K.GHOK"},{"$f":"VLOOKUP(A555,[2]Ledenlijst!$B$2:$N$707,7,FALSE)","v":"S"}]
["00795",{"$f":"VLOOKUP(A556,[2]Ledenlijst!$B$2:$N$707,2,FALSE)","v":"LAMMENS Raf"},{"$f":"VLOOKUP(A556,[2]Ledenlijst!$B$2:$N$707,13,FALSE)","v":"K.GHOK"},null,null,{"$f":"VLOOKUP(A556,[2]Ledenlijst!$B$2:$N$707,7,FALSE)","v":"K"}]
["00796",{"$f":"VLOOKUP(A557,[2]Ledenlijst!$B$2:$N$707,2,FALSE)","v":"LANNOO Marcel"},{"$f":"VLOOKUP(A557,[2]Ledenlijst!$B$2:$N$707,13,FALSE)","v":"K.GHOK"},null,null,{"$f":"VLOOKUP(A557,[2]Ledenlijst!$B$2:$N$707,7,FALSE)","v":"K"}]
[9433,{"$f":"VLOOKUP(A558,[2]Ledenlijst!$B$2:$N$707,2,FALSE)","v":"LATRUWE Nicolas"},{"$f":"VLOOKUP(A558,[2]Ledenlijst!$B$2:$N$707,13,FALSE)","v":"K.GHOK"},{"$f":"VLOOKUP(A558,[2]Ledenlijst!$B$2:$N$707,7,FALSE)","v":"S"}]
["00798",{"$f":"VLOOKUP(A559,[2]Ledenlijst!$B$2:$N$707,2,FALSE)","v":"LOUAGIE Bernard"},{"$f":"VLOOKUP(A559,[2]Ledenlijst!$B$2:$N$707,13,FALSE)","v":"K.GHOK"},null,null,{"$f":"VLOOKUP(A559,[2]Ledenlijst!$B$2:$N$707,7,FALSE)","v":"K"}]
[1143,{"$f":"VLOOKUP(A560,[2]Ledenlijst!$B$2:$N$707,2,FALSE)","v":"LOUAGIE Bjorn"},{"$f":"VLOOKUP(A560,[2]Ledenlijst!$B$2:$N$707,13,FALSE)","v":"K.GHOK"},{"$f":"VLOOKUP(A560,[2]Ledenlijst!$B$2:$N$707,7,FALSE)","v":"S"}]
[5746,{"$f":"VLOOKUP(A561,[2]Ledenlijst!$B$2:$N$707,2,FALSE)","v":"NICHELSON Pascal"},{"$f":"VLOOKUP(A561,[2]Ledenlijst!$B$2:$N$707,13,FALSE)","v":"K.GHOK"},{"$f":"VLOOKUP(A561,[2]Ledenlijst!$B$2:$N$707,7,FALSE)","v":"S"}]
["00799",{"$f":"VLOOKUP(A562,[2]Ledenlijst!$B$2:$N$707,2,FALSE)","v":"PLUYM Francois"},{"$f":"VLOOKUP(A562,[2]Ledenlijst!$B$2:$N$707,13,FALSE)","v":"K.GHOK"},null,null,{"$f":"VLOOKUP(A562,[2]Ledenlijst!$B$2:$N$707,7,FALSE)","v":"K"}]
[4656,{"$f":"VLOOKUP(A563,[2]Ledenlijst!$B$2:$N$707,2,FALSE)","v":"POLLIE Luc"},{"$f":"VLOOKUP(A563,[2]Ledenlijst!$B$2:$N$707,13,FALSE)","v":"K.GHOK"},{"$f":"VLOOKUP(A563,[2]Ledenlijst!$B$2:$N$707,7,FALSE)","v":"S"}]
[9531,{"$f":"VLOOKUP(A564,[2]Ledenlijst!$B$2:$N$707,2,FALSE)","v":"ROELAND Juliaan "},{"$f":"VLOOKUP(A564,[2]Ledenlijst!$B$2:$N$707,13,FALSE)","v":"K.GHOK"},{"$f":"VLOOKUP(A564,[2]Ledenlijst!$B$2:$N$707,7,FALSE)","v":"S"}]
[1056,{"$f":"VLOOKUP(A565,[2]Ledenlijst!$B$2:$N$707,2,FALSE)","v":"SANTY Eric"},{"$f":"VLOOKUP(A565,[2]Ledenlijst!$B$2:$N$707,13,FALSE)","v":"K.GHOK"},{"$f":"VLOOKUP(A565,[2]Ledenlijst!$B$2:$N$707,7,FALSE)","v":"S"}]
[7524,{"$f":"VLOOKUP(A566,[2]Ledenlijst!$B$2:$N$707,2,FALSE)","v":"SCHOKELE Ronny"},{"$f":"VLOOKUP(A566,[2]Ledenlijst!$B$2:$N$707,13,FALSE)","v":"K.GHOK"},{"$f":"VLOOKUP(A566,[2]Ledenlijst!$B$2:$N$707,7,FALSE)","v":"S"}]
["00800",{"$f":"VLOOKUP(A567,[2]Ledenlijst!$B$2:$N$707,2,FALSE)","v":"SEYNHAEVEWillem"},{"$f":"VLOOKUP(A567,[2]Ledenlijst!$B$2:$N$707,13,FALSE)","v":"K.GHOK"},null,null,{"$f":"VLOOKUP(A567,[2]Ledenlijst!$B$2:$N$707,7,FALSE)","v":"K"}]
[8702,{"$f":"VLOOKUP(A568,[2]Ledenlijst!$B$2:$N$707,2,FALSE)","v":"VAN DE VELDE August"},{"$f":"VLOOKUP(A568,[2]Ledenlijst!$B$2:$N$707,13,FALSE)","v":"K.GHOK"},{"$f":"VLOOKUP(A568,[2]Ledenlijst!$B$2:$N$707,7,FALSE)","v":"S"}]
["00801",{"$f":"VLOOKUP(A569,[2]Ledenlijst!$B$2:$N$707,2,FALSE)","v":"VANDEWALLE Marnix"},{"$f":"VLOOKUP(A569,[2]Ledenlijst!$B$2:$N$707,13,FALSE)","v":"K.GHOK"},null,null,{"$f":"VLOOKUP(A569,[2]Ledenlijst!$B$2:$N$707,7,FALSE)","v":"K"}]
["KKGH1",{"$f":"VLOOKUP(A570,[2]Ledenlijst!$B$2:$N$707,2,FALSE)","v":"VANHAESEBROEK Didier"},{"$f":"VLOOKUP(A570,[2]Ledenlijst!$B$2:$N$707,13,FALSE)","v":"K.GHOK"},null,null,{"$f":"VLOOKUP(A570,[2]Ledenlijst!$B$2:$N$707,7,FALSE)","v":"K"}]
["00805",{"$f":"VLOOKUP(A571,[2]Ledenlijst!$B$2:$N$707,2,FALSE)","v":"VAN HOVE NANCY"},{"$f":"VLOOKUP(A571,[2]Ledenlijst!$B$2:$N$707,13,FALSE)","v":"K.GHOK"},null,null,{"$f":"VLOOKUP(A571,[2]Ledenlijst!$B$2:$N$707,7,FALSE)","v":"K"}]
[3807,{"$f":"VLOOKUP(A572,[2]Ledenlijst!$B$2:$N$707,2,FALSE)","v":"VERBRUGGHE Johan"},{"$f":"VLOOKUP(A572,[2]Ledenlijst!$B$2:$N$707,13,FALSE)","v":"K.GHOK"},{"$f":"VLOOKUP(A572,[2]Ledenlijst!$B$2:$N$707,7,FALSE)","v":"S"}]
[9274,{"$f":"VLOOKUP(A573,[2]Ledenlijst!$B$2:$N$707,2,FALSE)","v":"VERBRUGGHE Philippe"},{"$f":"VLOOKUP(A573,[2]Ledenlijst!$B$2:$N$707,13,FALSE)","v":"K.GHOK"},{"$f":"VLOOKUP(A573,[2]Ledenlijst!$B$2:$N$707,7,FALSE)","v":"S"}]
["00806",{"$f":"VLOOKUP(A574,[2]Ledenlijst!$B$2:$N$707,2,FALSE)","v":"VERBRUGGHE Pol"},{"$f":"VLOOKUP(A574,[2]Ledenlijst!$B$2:$N$707,13,FALSE)","v":"K.GHOK"},null,null,{"$f":"VLOOKUP(A574,[2]Ledenlijst!$B$2:$N$707,7,FALSE)","v":"K"}]
["00807",{"$f":"VLOOKUP(A575,[2]Ledenlijst!$B$2:$N$707,2,FALSE)","v":"VERCAEMERE David"},{"$f":"VLOOKUP(A575,[2]Ledenlijst!$B$2:$N$707,13,FALSE)","v":"K.GHOK"},null,null,{"$f":"VLOOKUP(A575,[2]Ledenlijst!$B$2:$N$707,7,FALSE)","v":"K"}]
[8088,{"$f":"VLOOKUP(A576,[2]Ledenlijst!$B$2:$N$707,2,FALSE)","v":"VERCAEMERE Jaak"},{"$f":"VLOOKUP(A576,[2]Ledenlijst!$B$2:$N$707,13,FALSE)","v":"K.GHOK"},{"$f":"VLOOKUP(A576,[2]Ledenlijst!$B$2:$N$707,7,FALSE)","v":"S"}]
["00809",{"$f":"VLOOKUP(A577,[2]Ledenlijst!$B$2:$N$707,2,FALSE)","v":"VERCAEMERE Philippe"},{"$f":"VLOOKUP(A577,[2]Ledenlijst!$B$2:$N$707,13,FALSE)","v":"K.GHOK"},null,null,{"$f":"VLOOKUP(A577,[2]Ledenlijst!$B$2:$N$707,7,FALSE)","v":"K"}]
["00810",{"$f":"VLOOKUP(A578,[2]Ledenlijst!$B$2:$N$707,2,FALSE)","v":"VERCRUYSSE Jurgen"},{"$f":"VLOOKUP(A578,[2]Ledenlijst!$B$2:$N$707,13,FALSE)","v":"K.GHOK"},null,null,{"$f":"VLOOKUP(A578,[2]Ledenlijst!$B$2:$N$707,7,FALSE)","v":"K"}]
["00811",{"$f":"VLOOKUP(A579,[2]Ledenlijst!$B$2:$N$707,2,FALSE)","v":"VERCRUYSSE Marcel"},{"$f":"VLOOKUP(A579,[2]Ledenlijst!$B$2:$N$707,13,FALSE)","v":"K.GHOK"},null,null,{"$f":"VLOOKUP(A579,[2]Ledenlijst!$B$2:$N$707,7,FALSE)","v":"K"}]
["00808",{"$f":"VLOOKUP(A580,[2]Ledenlijst!$B$2:$N$707,2,FALSE)","v":"VERDIN Renaud"},{"$f":"VLOOKUP(A580,[2]Ledenlijst!$B$2:$N$707,13,FALSE)","v":"K.GHOK"},null,null,{"$f":"VLOOKUP(A580,[2]Ledenlijst!$B$2:$N$707,7,FALSE)","v":"K"}]
["00813",{"$f":"VLOOKUP(A581,[2]Ledenlijst!$B$2:$N$707,2,FALSE)","v":"VERHAGHE Freddy"},{"$f":"VLOOKUP(A581,[2]Ledenlijst!$B$2:$N$707,13,FALSE)","v":"K.GHOK"},null,null,{"$f":"VLOOKUP(A581,[2]Ledenlijst!$B$2:$N$707,7,FALSE)","v":"K"}]
[1058,{"$f":"VLOOKUP(A582,[2]Ledenlijst!$B$2:$N$707,2,FALSE)","v":"VERMEERSCH Dave"},{"$f":"VLOOKUP(A582,[2]Ledenlijst!$B$2:$N$707,13,FALSE)","v":"K.GHOK"},{"$f":"VLOOKUP(A582,[2]Ledenlijst!$B$2:$N$707,7,FALSE)","v":"S"}]
[8736,{"$f":"VLOOKUP(A583,[2]Ledenlijst!$B$2:$N$707,2,FALSE)","v":"VEYS Renzo"},{"$f":"VLOOKUP(A583,[2]Ledenlijst!$B$2:$N$707,13,FALSE)","v":"K.GHOK"},{"$f":"VLOOKUP(A583,[2]Ledenlijst!$B$2:$N$707,7,FALSE)","v":"S"}]
[9532,{"$f":"VLOOKUP(A584,[2]Ledenlijst!$B$2:$N$707,2,FALSE)","v":"VIENNE Isabelle"},{"$f":"VLOOKUP(A584,[2]Ledenlijst!$B$2:$N$707,13,FALSE)","v":"K.GHOK"},{"$f":"VLOOKUP(A584,[2]Ledenlijst!$B$2:$N$707,7,FALSE)","v":"S"}]
["00814",{"$f":"VLOOKUP(A585,[2]Ledenlijst!$B$2:$N$707,2,FALSE)","v":"VLIEGHE Marie-Claire"},{"$f":"VLOOKUP(A585,[2]Ledenlijst!$B$2:$N$707,13,FALSE)","v":"K.GHOK"},null,null,{"$f":"VLOOKUP(A585,[2]Ledenlijst!$B$2:$N$707,7,FALSE)","v":"K"}]
[7821,{"$f":"VLOOKUP(A586,[2]Ledenlijst!$B$2:$N$707,2,FALSE)","v":"VROMANT Marc"},{"$f":"VLOOKUP(A586,[2]Ledenlijst!$B$2:$N$707,13,FALSE)","v":"K.GHOK"},{"$f":"VLOOKUP(A586,[2]Ledenlijst!$B$2:$N$707,7,FALSE)","v":"S"}]
[7538,{"$f":"VLOOKUP(A587,[2]Ledenlijst!$B$2:$N$707,2,FALSE)","v":"WERBROUCK Geert"},{"$f":"VLOOKUP(A587,[2]Ledenlijst!$B$2:$N$707,13,FALSE)","v":"K.GHOK"},{"$f":"VLOOKUP(A587,[2]Ledenlijst!$B$2:$N$707,7,FALSE)","v":"S"},null,null,{"$f":"COUNTA(A522:A587)","v":66},null,"K.GHOK"]
[8704,{"$f":"VLOOKUP(A588,[2]Ledenlijst!$B$2:$N$707,2,FALSE)","v":"CALLENS Filip"},{"$f":"VLOOKUP(A588,[2]Ledenlijst!$B$2:$N$707,13,FALSE)","v":"DLS"},{"$f":"VLOOKUP(A588,[2]Ledenlijst!$B$2:$N$707,7,FALSE)","v":"S"}]
[4763,{"$f":"VLOOKUP(A589,[2]Ledenlijst!$B$2:$N$707,2,FALSE)","v":"CASTELEYN Rik"},{"$f":"VLOOKUP(A589,[2]Ledenlijst!$B$2:$N$707,13,FALSE)","v":"DLS"},{"$f":"VLOOKUP(A589,[2]Ledenlijst!$B$2:$N$707,7,FALSE)","v":"S"}]
[8689,{"$f":"VLOOKUP(A590,[2]Ledenlijst!$B$2:$N$707,2,FALSE)","v":"DEWAELE Eddy"},{"$f":"VLOOKUP(A590,[2]Ledenlijst!$B$2:$N$707,13,FALSE)","v":"DLS"},{"$f":"VLOOKUP(A590,[2]Ledenlijst!$B$2:$N$707,7,FALSE)","v":"S"}]
[8690,{"$f":"VLOOKUP(A591,[2]Ledenlijst!$B$2:$N$707,2,FALSE)","v":"JOYE Rik"},{"$f":"VLOOKUP(A591,[2]Ledenlijst!$B$2:$N$707,13,FALSE)","v":"DLS"},{"$f":"VLOOKUP(A591,[2]Ledenlijst!$B$2:$N$707,7,FALSE)","v":"S"},null,null,{"$f":"COUNTA(A588:A591)","v":4},null,"DLS"]
[1674,{"$f":"VLOOKUP(A592,[2]Ledenlijst!$B$2:$N$707,2,FALSE)","v":"DAELMAN Eric"},{"$f":"VLOOKUP(A592,[2]Ledenlijst!$B$2:$N$707,13,FALSE)","v":"PO"},{"$f":"VLOOKUP(A592,[2]Ledenlijst!$B$2:$N$707,7,FALSE)","v":"S"}]
["KKPO1",{"$f":"VLOOKUP(A593,[2]Ledenlijst!$B$2:$N$707,2,FALSE)","v":"DE MOOR Frederik"},{"$f":"VLOOKUP(A593,[2]Ledenlijst!$B$2:$N$707,13,FALSE)","v":"PO"},null,null,{"$f":"VLOOKUP(A593,[2]Ledenlijst!$B$2:$N$707,7,FALSE)","v":"K"}]
[7461,{"$f":"VLOOKUP(A594,[2]Ledenlijst!$B$2:$N$707,2,FALSE)","v":"GRIMON Johan"},{"$f":"VLOOKUP(A594,[2]Ledenlijst!$B$2:$N$707,13,FALSE)","v":"PO"},{"$f":"VLOOKUP(A594,[2]Ledenlijst!$B$2:$N$707,7,FALSE)","v":"S"}]
[9954,{"$f":"VLOOKUP(A595,[2]Ledenlijst!$B$2:$N$707,2,FALSE)","v":"PETRUS Kim"},{"$f":"VLOOKUP(A595,[2]Ledenlijst!$B$2:$N$707,13,FALSE)","v":"PO"},{"$f":"VLOOKUP(A595,[2]Ledenlijst!$B$2:$N$707,7,FALSE)","v":"S"}]
[9534,{"$f":"VLOOKUP(A596,[2]Ledenlijst!$B$2:$N$707,2,FALSE)","v":"VANHONACKER Dominique"},{"$f":"VLOOKUP(A596,[2]Ledenlijst!$B$2:$N$707,13,FALSE)","v":"PO"},{"$f":"VLOOKUP(A596,[2]Ledenlijst!$B$2:$N$707,7,FALSE)","v":"S"}]
[7605,{"$f":"VLOOKUP(A597,[2]Ledenlijst!$B$2:$N$707,2,FALSE)","v":"VAN SCHOOR Danny"},{"$f":"VLOOKUP(A597,[2]Ledenlijst!$B$2:$N$707,13,FALSE)","v":"PO"},{"$f":"VLOOKUP(A597,[2]Ledenlijst!$B$2:$N$707,7,FALSE)","v":"S"}]
[9953,{"$f":"VLOOKUP(A598,[2]Ledenlijst!$B$2:$N$707,2,FALSE)","v":"WILMS Steve"},{"$f":"VLOOKUP(A598,[2]Ledenlijst!$B$2:$N$707,13,FALSE)","v":"PO"},{"$f":"VLOOKUP(A598,[2]Ledenlijst!$B$2:$N$707,7,FALSE)","v":"S"},null,null,{"$f":"COUNTA(A592:A598)","v":7},null,"PO"]
[]
[null,null,{"$f":"COUNTA(C427:C599)","v":172},{"$f":"COUNTA(D427:D599)","v":131},{"$f":"COUNTA(E427:E599)","v":3},{"$f":"COUNTA(F427:F599)","v":37},null,{"$f":"SUM(G427:G599)","v":172},"Zuid W-Vl"]
[]
[]
[1294,{"$f":"VLOOKUP(A603,[2]Ledenlijst!$B$2:$N$707,2,FALSE)","v":"BACKMAN Werner"},{"$f":"VLOOKUP(A603,[2]Ledenlijst!$B$2:$N$707,13,FALSE)","v":"BCKS"},{"$f":"VLOOKUP(A603,[2]Ledenlijst!$B$2:$N$707,7,FALSE)","v":"S"}]
[7812,{"$f":"VLOOKUP(A604,[2]Ledenlijst!$B$2:$N$707,2,FALSE)","v":"BOERJAN Pierre"},{"$f":"VLOOKUP(A604,[2]Ledenlijst!$B$2:$N$707,13,FALSE)","v":"BCKS"},{"$f":"VLOOKUP(A604,[2]Ledenlijst!$B$2:$N$707,7,FALSE)","v":"S"}]
["00015",{"$f":"VLOOKUP(A605,[2]Ledenlijst!$B$2:$N$707,2,FALSE)","v":"CAP Jessica"},{"$f":"VLOOKUP(A605,[2]Ledenlijst!$B$2:$N$707,13,FALSE)","v":"BCSK"},null,null,{"$f":"VLOOKUP(A605,[2]Ledenlijst!$B$2:$N$707,7,FALSE)","v":"K"}]
[4894,{"$f":"VLOOKUP(A606,[2]Ledenlijst!$B$2:$N$707,2,FALSE)","v":"DAELMAN Walther"},{"$f":"VLOOKUP(A606,[2]Ledenlijst!$B$2:$N$707,13,FALSE)","v":"BCSK"},{"$f":"VLOOKUP(A606,[2]Ledenlijst!$B$2:$N$707,7,FALSE)","v":"S"}]
[4895,{"$f":"VLOOKUP(A607,[2]Ledenlijst!$B$2:$N$707,2,FALSE)","v":"DE BLOCK Omer"},{"$f":"VLOOKUP(A607,[2]Ledenlijst!$B$2:$N$707,13,FALSE)","v":"BCSK"},{"$f":"VLOOKUP(A607,[2]Ledenlijst!$B$2:$N$707,7,FALSE)","v":"S"}]
[9276,{"$f":"VLOOKUP(A608,[2]Ledenlijst!$B$2:$N$707,2,FALSE)","v":"DE KORT Marc"},{"$f":"VLOOKUP(A608,[2]Ledenlijst!$B$2:$N$707,13,FALSE)","v":"BCKS"},{"$f":"VLOOKUP(A608,[2]Ledenlijst!$B$2:$N$707,7,FALSE)","v":"S"}]
[9955,{"$f":"VLOOKUP(A609,[2]Ledenlijst!$B$2:$N$707,2,FALSE)","v":"DE RUDDER David"},{"$f":"VLOOKUP(A609,[2]Ledenlijst!$B$2:$N$707,13,FALSE)","v":"BCKS"},{"$f":"VLOOKUP(A609,[2]Ledenlijst!$B$2:$N$707,7,FALSE)","v":"S"}]
[6488,{"$f":"VLOOKUP(A610,[2]Ledenlijst!$B$2:$N$707,2,FALSE)","v":"DE WITTE Franky"},{"$f":"VLOOKUP(A610,[2]Ledenlijst!$B$2:$N$707,13,FALSE)","v":"BCSK"},{"$f":"VLOOKUP(A610,[2]Ledenlijst!$B$2:$N$707,7,FALSE)","v":"S"}]
[6489,{"$f":"VLOOKUP(A611,[2]Ledenlijst!$B$2:$N$707,2,FALSE)","v":"DE WITTE Jeffrey"},{"$f":"VLOOKUP(A611,[2]Ledenlijst!$B$2:$N$707,13,FALSE)","v":"BCSK"},{"$f":"VLOOKUP(A611,[2]Ledenlijst!$B$2:$N$707,7,FALSE)","v":"S"}]
[8073,{"$f":"VLOOKUP(A612,[2]Ledenlijst!$B$2:$N$707,2,FALSE)","v":"DE WITTE Tamara"},{"$f":"VLOOKUP(A612,[2]Ledenlijst!$B$2:$N$707,13,FALSE)","v":"BCSK"},{"$f":"VLOOKUP(A612,[2]Ledenlijst!$B$2:$N$707,7,FALSE)","v":"S"}]
[8385,{"$f":"VLOOKUP(A613,[2]Ledenlijst!$B$2:$N$707,2,FALSE)","v":"GODDAERT Johan"},{"$f":"VLOOKUP(A613,[2]Ledenlijst!$B$2:$N$707,13,FALSE)","v":"BCSK"},{"$f":"VLOOKUP(A613,[2]Ledenlijst!$B$2:$N$707,7,FALSE)","v":"S"}]
[8900,{"$f":"VLOOKUP(A614,[2]Ledenlijst!$B$2:$N$707,2,FALSE)","v":"JANSSENS Dirk"},{"$f":"VLOOKUP(A614,[2]Ledenlijst!$B$2:$N$707,13,FALSE)","v":"BCSK"},{"$f":"VLOOKUP(A614,[2]Ledenlijst!$B$2:$N$707,7,FALSE)","v":"S"}]
[4937,{"$f":"VLOOKUP(A615,[2]Ledenlijst!$B$2:$N$707,2,FALSE)","v":"LEEMANS Willy"},{"$f":"VLOOKUP(A615,[2]Ledenlijst!$B$2:$N$707,13,FALSE)","v":"BCSK"},{"$f":"VLOOKUP(A615,[2]Ledenlijst!$B$2:$N$707,7,FALSE)","v":"S"}]
[4853,{"$f":"VLOOKUP(A616,[2]Ledenlijst!$B$2:$N$707,2,FALSE)","v":"NOPPE Robert"},{"$f":"VLOOKUP(A616,[2]Ledenlijst!$B$2:$N$707,13,FALSE)","v":"BCSK"},{"$f":"VLOOKUP(A616,[2]Ledenlijst!$B$2:$N$707,7,FALSE)","v":"S"}]
[9441,{"$f":"VLOOKUP(A617,[2]Ledenlijst!$B$2:$N$707,2,FALSE)","v":"ROSIER Nick"},{"$f":"VLOOKUP(A617,[2]Ledenlijst!$B$2:$N$707,13,FALSE)","v":"BCSK"},null,{"$f":"VLOOKUP(A617,[2]Ledenlijst!$B$2:$N$707,7,FALSE)","v":"J"}]
[4854,{"$f":"VLOOKUP(A618,[2]Ledenlijst!$B$2:$N$707,2,FALSE)","v":"ROSIER Peter"},{"$f":"VLOOKUP(A618,[2]Ledenlijst!$B$2:$N$707,13,FALSE)","v":"BCSK"},{"$f":"VLOOKUP(A618,[2]Ledenlijst!$B$2:$N$707,7,FALSE)","v":"S"}]
["6712B",{"$f":"VLOOKUP(A619,[2]Ledenlijst!$B$2:$N$707,2,FALSE)","v":"SEGERS Didier"},{"$f":"VLOOKUP(A619,[2]Ledenlijst!$B$2:$N$707,13,FALSE)","v":"BCSK"},{"$f":"VLOOKUP(A619,[2]Ledenlijst!$B$2:$N$707,7,FALSE)","v":"S"}]
["6784B",{"$f":"VLOOKUP(A620,[2]Ledenlijst!$B$2:$N$707,2,FALSE)","v":"VAN BIESEN Tom"},{"$f":"VLOOKUP(A620,[2]Ledenlijst!$B$2:$N$707,13,FALSE)","v":"BCSK"},{"$f":"VLOOKUP(A620,[2]Ledenlijst!$B$2:$N$707,7,FALSE)","v":"S"}]
[8133,{"$f":"VLOOKUP(A621,[2]Ledenlijst!$B$2:$N$707,2,FALSE)","v":"VAN CRAENENBROECK Theo"},{"$f":"VLOOKUP(A621,[2]Ledenlijst!$B$2:$N$707,13,FALSE)","v":"BCSK"},{"$f":"VLOOKUP(A621,[2]Ledenlijst!$B$2:$N$707,7,FALSE)","v":"S"}]
[8717,{"$f":"VLOOKUP(A622,[2]Ledenlijst!$B$2:$N$707,2,FALSE)","v":"VAN den EEDEN Kurt"},{"$f":"VLOOKUP(A622,[2]Ledenlijst!$B$2:$N$707,13,FALSE)","v":"BCSK"},{"$f":"VLOOKUP(A622,[2]Ledenlijst!$B$2:$N$707,7,FALSE)","v":"S"}]
["00284",{"$f":"VLOOKUP(A623,[2]Ledenlijst!$B$2:$N$707,2,FALSE)","v":"VAN HECKE Rita"},{"$f":"VLOOKUP(A623,[2]Ledenlijst!$B$2:$N$707,13,FALSE)","v":"BCSK"},null,null,{"$f":"VLOOKUP(A623,[2]Ledenlijst!$B$2:$N$707,7,FALSE)","v":"K"}]
[8674,{"$f":"VLOOKUP(A624,[2]Ledenlijst!$B$2:$N$707,2,FALSE)","v":"VAN LEUVENHAGE Dylan"},{"$f":"VLOOKUP(A624,[2]Ledenlijst!$B$2:$N$707,13,FALSE)","v":"BCSK"},{"$f":"VLOOKUP(A624,[2]Ledenlijst!$B$2:$N$707,7,FALSE)","v":"S"}]
["6117B",{"$f":"VLOOKUP(A625,[2]Ledenlijst!$B$2:$N$707,2,FALSE)","v":"VAN VOSSELEN Christoph"},{"$f":"VLOOKUP(A625,[2]Ledenlijst!$B$2:$N$707,13,FALSE)","v":"BCSK"},{"$f":"VLOOKUP(A625,[2]Ledenlijst!$B$2:$N$707,7,FALSE)","v":"S"},null,null,{"$f":"COUNTA(A603:A625)","v":23},null,"BCKS"]
["00698",{"$f":"VLOOKUP(A626,[2]Ledenlijst!$B$2:$N$707,2,FALSE)","v":"BRITO Dos Santos Letitia"},{"$f":"VLOOKUP(A626,[2]Ledenlijst!$B$2:$N$707,13,FALSE)","v":"KGV"},null,null,{"$f":"VLOOKUP(A626,[2]Ledenlijst!$B$2:$N$707,7,FALSE)","v":"K"}]
[5232,{"$f":"VLOOKUP(A627,[2]Ledenlijst!$B$2:$N$707,2,FALSE)","v":"CORNET Walther"},{"$f":"VLOOKUP(A627,[2]Ledenlijst!$B$2:$N$707,13,FALSE)","v":"KGV"},{"$f":"VLOOKUP(A627,[2]Ledenlijst!$B$2:$N$707,7,FALSE)","v":"S"}]
[1062,{"$f":"VLOOKUP(A628,[2]Ledenlijst!$B$2:$N$707,2,FALSE)","v":"DE WREEDE Marc"},{"$f":"VLOOKUP(A628,[2]Ledenlijst!$B$2:$N$707,13,FALSE)","v":"KGV"},{"$f":"VLOOKUP(A628,[2]Ledenlijst!$B$2:$N$707,7,FALSE)","v":"S"}]
[4865,{"$f":"VLOOKUP(A629,[2]Ledenlijst!$B$2:$N$707,2,FALSE)","v":"HAEGENS Willy"},{"$f":"VLOOKUP(A629,[2]Ledenlijst!$B$2:$N$707,13,FALSE)","v":"KGV"},{"$f":"VLOOKUP(A629,[2]Ledenlijst!$B$2:$N$707,7,FALSE)","v":"S"}]
[6712,{"$f":"VLOOKUP(A630,[2]Ledenlijst!$B$2:$N$707,2,FALSE)","v":"SEGERS Didier"},{"$f":"VLOOKUP(A630,[2]Ledenlijst!$B$2:$N$707,13,FALSE)","v":"KGV"},{"$f":"VLOOKUP(A630,[2]Ledenlijst!$B$2:$N$707,7,FALSE)","v":"S"}]
[6784,{"$f":"VLOOKUP(A631,[2]Ledenlijst!$B$2:$N$707,2,FALSE)","v":"VAN BIESEN Tom"},{"$f":"VLOOKUP(A631,[2]Ledenlijst!$B$2:$N$707,13,FALSE)","v":"KGV"},{"$f":"VLOOKUP(A631,[2]Ledenlijst!$B$2:$N$707,7,FALSE)","v":"S"}]
[8870,{"$f":"VLOOKUP(A632,[2]Ledenlijst!$B$2:$N$707,2,FALSE)","v":"VAN MEIRVENNE Nestor"},{"$f":"VLOOKUP(A632,[2]Ledenlijst!$B$2:$N$707,13,FALSE)","v":"KGV"},{"$f":"VLOOKUP(A632,[2]Ledenlijst!$B$2:$N$707,7,FALSE)","v":"S"}]
[5229,{"$f":"VLOOKUP(A633,[2]Ledenlijst!$B$2:$N$707,2,FALSE)","v":"VAN MELE Franky"},{"$f":"VLOOKUP(A633,[2]Ledenlijst!$B$2:$N$707,13,FALSE)","v":"KGV"},{"$f":"VLOOKUP(A633,[2]Ledenlijst!$B$2:$N$707,7,FALSE)","v":"S"}]
[4872,{"$f":"VLOOKUP(A634,[2]Ledenlijst!$B$2:$N$707,2,FALSE)","v":"VAN VOSSEL Danny"},{"$f":"VLOOKUP(A634,[2]Ledenlijst!$B$2:$N$707,13,FALSE)","v":"KGV"},{"$f":"VLOOKUP(A634,[2]Ledenlijst!$B$2:$N$707,7,FALSE)","v":"S"}]
[6117,{"$f":"VLOOKUP(A635,[2]Ledenlijst!$B$2:$N$707,2,FALSE)","v":"VAN VOSSELEN Christoph"},{"$f":"VLOOKUP(A635,[2]Ledenlijst!$B$2:$N$707,13,FALSE)","v":"KGV"},{"$f":"VLOOKUP(A635,[2]Ledenlijst!$B$2:$N$707,7,FALSE)","v":"S"}]
[9967,{"$f":"VLOOKUP(A636,[2]Ledenlijst!$B$2:$N$707,2,FALSE)","v":"VETS Sven"},{"$f":"VLOOKUP(A636,[2]Ledenlijst!$B$2:$N$707,13,FALSE)","v":"KGV"},{"$f":"VLOOKUP(A636,[2]Ledenlijst!$B$2:$N$707,7,FALSE)","v":"S"}]
[9082,{"$f":"VLOOKUP(A637,[2]Ledenlijst!$B$2:$N$707,2,FALSE)","v":"WAEM Kris"},{"$f":"VLOOKUP(A637,[2]Ledenlijst!$B$2:$N$707,13,FALSE)","v":"KGV"},{"$f":"VLOOKUP(A637,[2]Ledenlijst!$B$2:$N$707,7,FALSE)","v":"S"}]
[9533,{"$f":"VLOOKUP(A638,[2]Ledenlijst!$B$2:$N$707,2,FALSE)","v":"WUYTACK Gunther"},{"$f":"VLOOKUP(A638,[2]Ledenlijst!$B$2:$N$707,13,FALSE)","v":"KGV"},{"$f":"VLOOKUP(A638,[2]Ledenlijst!$B$2:$N$707,7,FALSE)","v":"S"},null,null,{"$f":"COUNTA(A626:A638)","v":13},null,"KGV"]
[6851,{"$f":"VLOOKUP(A639,[2]Ledenlijst!$B$2:$N$707,2,FALSE)","v":"ALLEMAN Mark"},{"$f":"VLOOKUP(A639,[2]Ledenlijst!$B$2:$N$707,13,FALSE)","v":"WM"},{"$f":"VLOOKUP(A639,[2]Ledenlijst!$B$2:$N$707,7,FALSE)","v":"S"}]
[1063,{"$f":"VLOOKUP(A640,[2]Ledenlijst!$B$2:$N$707,2,FALSE)","v":"BERTOLOTTI Beatrice"},{"$f":"VLOOKUP(A640,[2]Ledenlijst!$B$2:$N$707,13,FALSE)","v":"WM"},{"$f":"VLOOKUP(A640,[2]Ledenlijst!$B$2:$N$707,7,FALSE)","v":"S"}]
[5486,{"$f":"VLOOKUP(A641,[2]Ledenlijst!$B$2:$N$707,2,FALSE)","v":"BROEDERS Adrianus"},{"$f":"VLOOKUP(A641,[2]Ledenlijst!$B$2:$N$707,13,FALSE)","v":"WM"},{"$f":"VLOOKUP(A641,[2]Ledenlijst!$B$2:$N$707,7,FALSE)","v":"S"}]
["00684",{"$f":"VLOOKUP(A642,[2]Ledenlijst!$B$2:$N$707,2,FALSE)","v":"BROEDERS Cynthia"},{"$f":"VLOOKUP(A642,[2]Ledenlijst!$B$2:$N$707,13,FALSE)","v":"WM"},null,null,{"$f":"VLOOKUP(A642,[2]Ledenlijst!$B$2:$N$707,7,FALSE)","v":"K"}]
["00362",{"$f":"VLOOKUP(A643,[2]Ledenlijst!$B$2:$N$707,2,FALSE)","v":"CALLUY Patricia"},{"$f":"VLOOKUP(A643,[2]Ledenlijst!$B$2:$N$707,13,FALSE)","v":"WM"},null,null,{"$f":"VLOOKUP(A643,[2]Ledenlijst!$B$2:$N$707,7,FALSE)","v":"K"}]
[7551,{"$f":"VLOOKUP(A644,[2]Ledenlijst!$B$2:$N$707,2,FALSE)","v":"CLAESSENS Walter"},{"$f":"VLOOKUP(A644,[2]Ledenlijst!$B$2:$N$707,13,FALSE)","v":"WM"},{"$f":"VLOOKUP(A644,[2]Ledenlijst!$B$2:$N$707,7,FALSE)","v":"S"}]
["00166",{"$f":"VLOOKUP(A645,[2]Ledenlijst!$B$2:$N$707,2,FALSE)","v":"COLMAN Anita"},{"$f":"VLOOKUP(A645,[2]Ledenlijst!$B$2:$N$707,13,FALSE)","v":"WM"},null,null,{"$f":"VLOOKUP(A645,[2]Ledenlijst!$B$2:$N$707,7,FALSE)","v":"K"}]
[8939,{"$f":"VLOOKUP(A646,[2]Ledenlijst!$B$2:$N$707,2,FALSE)","v":"CORNIL Pascal"},{"$f":"VLOOKUP(A646,[2]Ledenlijst!$B$2:$N$707,13,FALSE)","v":"WM"},{"$f":"VLOOKUP(A646,[2]Ledenlijst!$B$2:$N$707,7,FALSE)","v":"S"}]
[1188,{"$f":"VLOOKUP(A647,[2]Ledenlijst!$B$2:$N$707,2,FALSE)","v":"DE CLEEN Joeri"},{"$f":"VLOOKUP(A647,[2]Ledenlijst!$B$2:$N$707,13,FALSE)","v":"WM"},{"$f":"VLOOKUP(A647,[2]Ledenlijst!$B$2:$N$707,7,FALSE)","v":"S"}]
[1189,{"$f":"VLOOKUP(A648,[2]Ledenlijst!$B$2:$N$707,2,FALSE)","v":"DE CLEEN Sylvain"},{"$f":"VLOOKUP(A648,[2]Ledenlijst!$B$2:$N$707,13,FALSE)","v":"WM"},{"$f":"VLOOKUP(A648,[2]Ledenlijst!$B$2:$N$707,7,FALSE)","v":"S"}]
[4666,{"$f":"VLOOKUP(A649,[2]Ledenlijst!$B$2:$N$707,2,FALSE)","v":"DECONINCK Franky"},{"$f":"VLOOKUP(A649,[2]Ledenlijst!$B$2:$N$707,13,FALSE)","v":"DOS"},{"$f":"VLOOKUP(A649,[2]Ledenlijst!$B$2:$N$707,7,FALSE)","v":"S"}]
[1195,{"$f":"VLOOKUP(A650,[2]Ledenlijst!$B$2:$N$707,2,FALSE)","v":"DELVAUX Benoni"},{"$f":"VLOOKUP(A650,[2]Ledenlijst!$B$2:$N$707,13,FALSE)","v":"WM"},{"$f":"VLOOKUP(A650,[2]Ledenlijst!$B$2:$N$707,7,FALSE)","v":"S"}]
["1193B",{"$f":"VLOOKUP(A651,[2]Ledenlijst!$B$2:$N$707,2,FALSE)","v":"DE SCHEPPER Patrick"},{"$f":"VLOOKUP(A651,[2]Ledenlijst!$B$2:$N$707,13,FALSE)","v":"WM"},{"$f":"VLOOKUP(A651,[2]Ledenlijst!$B$2:$N$707,7,FALSE)","v":"S"}]
[6953,{"$f":"VLOOKUP(A652,[2]Ledenlijst!$B$2:$N$707,2,FALSE)","v":"DEWIT Anthony"},{"$f":"VLOOKUP(A652,[2]Ledenlijst!$B$2:$N$707,13,FALSE)","v":"WM"},{"$f":"VLOOKUP(A652,[2]Ledenlijst!$B$2:$N$707,7,FALSE)","v":"S"}]
[8077,{"$f":"VLOOKUP(A653,[2]Ledenlijst!$B$2:$N$707,2,FALSE)","v":"DE WOLF Alfons"},{"$f":"VLOOKUP(A653,[2]Ledenlijst!$B$2:$N$707,13,FALSE)","v":"WM"},{"$f":"VLOOKUP(A653,[2]Ledenlijst!$B$2:$N$707,7,FALSE)","v":"S"}]
["00124",{"$f":"VLOOKUP(A654,[2]Ledenlijst!$B$2:$N$707,2,FALSE)","v":"D'HOOGHE Christiane"},{"$f":"VLOOKUP(A654,[2]Ledenlijst!$B$2:$N$707,13,FALSE)","v":"WM"},null,null,{"$f":"VLOOKUP(A654,[2]Ledenlijst!$B$2:$N$707,7,FALSE)","v":"K"}]
["00891",{"$f":"VLOOKUP(A655,[2]Ledenlijst!$B$2:$N$707,2,FALSE)","v":"FORTON Christophe"},{"$f":"VLOOKUP(A655,[2]Ledenlijst!$B$2:$N$707,13,FALSE)","v":"WM"},null,null,{"$f":"VLOOKUP(A655,[2]Ledenlijst!$B$2:$N$707,7,FALSE)","v":"K"}]
[2215,{"$f":"VLOOKUP(A656,[2]Ledenlijst!$B$2:$N$707,2,FALSE)","v":"FORTON Francis"},{"$f":"VLOOKUP(A656,[2]Ledenlijst!$B$2:$N$707,13,FALSE)","v":"WM"},{"$f":"VLOOKUP(A656,[2]Ledenlijst!$B$2:$N$707,7,FALSE)","v":"S"}]
["00183",{"$f":"VLOOKUP(A657,[2]Ledenlijst!$B$2:$N$707,2,FALSE)","v":"GOMBERT Nathalie"},{"$f":"VLOOKUP(A657,[2]Ledenlijst!$B$2:$N$707,13,FALSE)","v":"WM"},null,null,{"$f":"VLOOKUP(A657,[2]Ledenlijst!$B$2:$N$707,7,FALSE)","v":"K"}]
[8661,{"$f":"VLOOKUP(A658,[2]Ledenlijst!$B$2:$N$707,2,FALSE)","v":"HEYNDRICKX Vik"},{"$f":"VLOOKUP(A658,[2]Ledenlijst!$B$2:$N$707,13,FALSE)","v":"WM"},{"$f":"VLOOKUP(A658,[2]Ledenlijst!$B$2:$N$707,7,FALSE)","v":"S"}]
[8026,{"$f":"VLOOKUP(A659,[2]Ledenlijst!$B$2:$N$707,2,FALSE)","v":"HOFMAN Glen"},{"$f":"VLOOKUP(A659,[2]Ledenlijst!$B$2:$N$707,13,FALSE)","v":"WM"},{"$f":"VLOOKUP(A659,[2]Ledenlijst!$B$2:$N$707,7,FALSE)","v":"S"}]
[1004,{"$f":"VLOOKUP(A660,[2]Ledenlijst!$B$2:$N$707,2,FALSE)","v":"HOSTENS Stefaan"},{"$f":"VLOOKUP(A660,[2]Ledenlijst!$B$2:$N$707,13,FALSE)","v":"WM"},{"$f":"VLOOKUP(A660,[2]Ledenlijst!$B$2:$N$707,7,FALSE)","v":"S"}]
["00715",{"$f":"VLOOKUP(A661,[2]Ledenlijst!$B$2:$N$707,2,FALSE)","v":"PATERNOSTER Rita"},{"$f":"VLOOKUP(A661,[2]Ledenlijst!$B$2:$N$707,13,FALSE)","v":"WM"},null,null,{"$f":"VLOOKUP(A661,[2]Ledenlijst!$B$2:$N$707,7,FALSE)","v":"K"}]
[1005,{"$f":"VLOOKUP(A662,[2]Ledenlijst!$B$2:$N$707,2,FALSE)","v":"PEETERS Leo"},{"$f":"VLOOKUP(A662,[2]Ledenlijst!$B$2:$N$707,13,FALSE)","v":"WM"},{"$f":"VLOOKUP(A662,[2]Ledenlijst!$B$2:$N$707,7,FALSE)","v":"S"}]
["00363",{"$f":"VLOOKUP(A663,[2]Ledenlijst!$B$2:$N$707,2,FALSE)","v":"PERSOENS Nathalie"},{"$f":"VLOOKUP(A663,[2]Ledenlijst!$B$2:$N$707,13,FALSE)","v":"WM"},null,null,{"$f":"VLOOKUP(A663,[2]Ledenlijst!$B$2:$N$707,7,FALSE)","v":"K"}]
[4405,{"$f":"VLOOKUP(A664,[2]Ledenlijst!$B$2:$N$707,2,FALSE)","v":"SCHIETTECATTE Yves"},{"$f":"VLOOKUP(A664,[2]Ledenlijst!$B$2:$N$707,13,FALSE)","v":"WM"},{"$f":"VLOOKUP(A664,[2]Ledenlijst!$B$2:$N$707,7,FALSE)","v":"S"}]
["00889",{"$f":"VLOOKUP(A665,[2]Ledenlijst!$B$2:$N$707,2,FALSE)","v":"SPOORMANS Martin"},{"$f":"VLOOKUP(A665,[2]Ledenlijst!$B$2:$N$707,13,FALSE)","v":"WM"},null,null,{"$f":"VLOOKUP(A665,[2]Ledenlijst!$B$2:$N$707,7,FALSE)","v":"K"}]
["2192B",{"$f":"VLOOKUP(A666,[2]Ledenlijst!$B$2:$N$707,2,FALSE)","v":"STERCKVAL Michel"},{"$f":"VLOOKUP(A666,[2]Ledenlijst!$B$2:$N$707,13,FALSE)","v":"WM"},{"$f":"VLOOKUP(A666,[2]Ledenlijst!$B$2:$N$707,7,FALSE)","v":"S"}]
["00890",{"$f":"VLOOKUP(A667,[2]Ledenlijst!$B$2:$N$707,2,FALSE)","v":"TRENTINO Ismael"},{"$f":"VLOOKUP(A667,[2]Ledenlijst!$B$2:$N$707,13,FALSE)","v":"WM"},null,null,{"$f":"VLOOKUP(A667,[2]Ledenlijst!$B$2:$N$707,7,FALSE)","v":"K"}]
["1168B",{"$f":"VLOOKUP(A668,[2]Ledenlijst!$B$2:$N$707,2,FALSE)","v":"VAN BAREL Ferdinand"},{"$f":"VLOOKUP(A668,[2]Ledenlijst!$B$2:$N$707,13,FALSE)","v":"WM"},{"$f":"VLOOKUP(A668,[2]Ledenlijst!$B$2:$N$707,7,FALSE)","v":"S"}]
["5727B",{"$f":"VLOOKUP(A669,[2]Ledenlijst!$B$2:$N$707,2,FALSE)","v":"VAN GOETHEM Benny"},{"$f":"VLOOKUP(A669,[2]Ledenlijst!$B$2:$N$707,13,FALSE)","v":"WM"},{"$f":"VLOOKUP(A669,[2]Ledenlijst!$B$2:$N$707,7,FALSE)","v":"S"}]
["00364",{"$f":"VLOOKUP(A670,[2]Ledenlijst!$B$2:$N$707,2,FALSE)","v":"VAN LANDEGHEM Veerle"},{"$f":"VLOOKUP(A670,[2]Ledenlijst!$B$2:$N$707,13,FALSE)","v":"WM"},null,null,{"$f":"VLOOKUP(A670,[2]Ledenlijst!$B$2:$N$707,7,FALSE)","v":"K"}]
[7521,{"$f":"VLOOKUP(A671,[2]Ledenlijst!$B$2:$N$707,2,FALSE)","v":"VERBERT Eddy"},{"$f":"VLOOKUP(A671,[2]Ledenlijst!$B$2:$N$707,13,FALSE)","v":"WM"},{"$f":"VLOOKUP(A671,[2]Ledenlijst!$B$2:$N$707,7,FALSE)","v":"S"}]
["00737",{"$f":"VLOOKUP(A672,[2]Ledenlijst!$B$2:$N$707,2,FALSE)","v":"VERCAUTEREN Berlinde"},{"$f":"VLOOKUP(A672,[2]Ledenlijst!$B$2:$N$707,13,FALSE)","v":"WM"},null,null,{"$f":"VLOOKUP(A672,[2]Ledenlijst!$B$2:$N$707,7,FALSE)","v":"K"}]
[4841,{"$f":"VLOOKUP(A673,[2]Ledenlijst!$B$2:$N$707,2,FALSE)","v":"VERPLANCKE Jean Paul"},{"$f":"VLOOKUP(A673,[2]Ledenlijst!$B$2:$N$707,13,FALSE)","v":"WM"},{"$f":"VLOOKUP(A673,[2]Ledenlijst!$B$2:$N$707,7,FALSE)","v":"S"}]
["00815",{"$f":"VLOOKUP(A674,[2]Ledenlijst!$B$2:$N$707,2,FALSE)","v":"VERSCHUREN Kathleen"},{"$f":"VLOOKUP(A674,[2]Ledenlijst!$B$2:$N$707,13,FALSE)","v":"WM"},null,null,{"$f":"VLOOKUP(A674,[2]Ledenlijst!$B$2:$N$707,7,FALSE)","v":"K"}]
[4842,{"$f":"VLOOKUP(A675,[2]Ledenlijst!$B$2:$N$707,2,FALSE)","v":"WAUTERS Tom"},{"$f":"VLOOKUP(A675,[2]Ledenlijst!$B$2:$N$707,13,FALSE)","v":"WM"},{"$f":"VLOOKUP(A675,[2]Ledenlijst!$B$2:$N$707,7,FALSE)","v":"S"}]
[2206,{"$f":"VLOOKUP(A676,[2]Ledenlijst!$B$2:$N$707,2,FALSE)","v":"WEEREMANS Dirk"},{"$f":"VLOOKUP(A676,[2]Ledenlijst!$B$2:$N$707,13,FALSE)","v":"WM"},{"$f":"VLOOKUP(A676,[2]Ledenlijst!$B$2:$N$707,7,FALSE)","v":"S"}]
["00744",{"$f":"VLOOKUP(A677,[2]Ledenlijst!$B$2:$N$707,2,FALSE)","v":"WENSELAERS Frieda"},{"$f":"VLOOKUP(A677,[2]Ledenlijst!$B$2:$N$707,13,FALSE)","v":"WM"},null,null,{"$f":"VLOOKUP(A677,[2]Ledenlijst!$B$2:$N$707,7,FALSE)","v":"K"}]
["00880",{"$f":"VLOOKUP(A678,[2]Ledenlijst!$B$2:$N$707,2,FALSE)","v":"WINCKELMANS Els"},{"$f":"VLOOKUP(A678,[2]Ledenlijst!$B$2:$N$707,13,FALSE)","v":"WM"},null,null,{"$f":"VLOOKUP(A678,[2]Ledenlijst!$B$2:$N$707,7,FALSE)","v":"K"},{"$f":"COUNTA(A639:A678)","v":40},null,"WM"]
["00678",{"$f":"VLOOKUP(A679,[2]Ledenlijst!$B$2:$N$707,2,FALSE)","v":"ANDRIES Dina"},{"$f":"VLOOKUP(A679,[2]Ledenlijst!$B$2:$N$707,13,FALSE)","v":"KSNBA"},null,null,{"$f":"VLOOKUP(A679,[2]Ledenlijst!$B$2:$N$707,7,FALSE)","v":"K"}]
["00150",{"$f":"VLOOKUP(A680,[2]Ledenlijst!$B$2:$N$707,2,FALSE)","v":"BUYS Frans"},{"$f":"VLOOKUP(A680,[2]Ledenlijst!$B$2:$N$707,13,FALSE)","v":"KSNBA"},null,null,{"$f":"VLOOKUP(A680,[2]Ledenlijst!$B$2:$N$707,7,FALSE)","v":"K"}]
[4859,{"$f":"VLOOKUP(A681,[2]Ledenlijst!$B$2:$N$707,2,FALSE)","v":"CHRISTIAENS Johan"},{"$f":"VLOOKUP(A681,[2]Ledenlijst!$B$2:$N$707,13,FALSE)","v":"KSNBA"},{"$f":"VLOOKUP(A681,[2]Ledenlijst!$B$2:$N$707,7,FALSE)","v":"S"}]
[4907,{"$f":"VLOOKUP(A682,[2]Ledenlijst!$B$2:$N$707,2,FALSE)","v":"CORNELISSEN Pierre"},{"$f":"VLOOKUP(A682,[2]Ledenlijst!$B$2:$N$707,13,FALSE)","v":"KSNBA"},{"$f":"VLOOKUP(A682,[2]Ledenlijst!$B$2:$N$707,7,FALSE)","v":"S"}]
[4950,{"$f":"VLOOKUP(A683,[2]Ledenlijst!$B$2:$N$707,2,FALSE)","v":"DE CONINCK Achille"},{"$f":"VLOOKUP(A683,[2]Ledenlijst!$B$2:$N$707,13,FALSE)","v":"KSNBA"},{"$f":"VLOOKUP(A683,[2]Ledenlijst!$B$2:$N$707,7,FALSE)","v":"S"}]
["00480",{"$f":"VLOOKUP(A684,[2]Ledenlijst!$B$2:$N$707,2,FALSE)","v":"de LANOY Marleen"},{"$f":"VLOOKUP(A684,[2]Ledenlijst!$B$2:$N$707,13,FALSE)","v":"KSNBA"},null,null,{"$f":"VLOOKUP(A684,[2]Ledenlijst!$B$2:$N$707,7,FALSE)","v":"K"}]
[6122,{"$f":"VLOOKUP(A685,[2]Ledenlijst!$B$2:$N$707,2,FALSE)","v":"DE MAEYER Joris"},{"$f":"VLOOKUP(A685,[2]Ledenlijst!$B$2:$N$707,13,FALSE)","v":"KSNBA"},{"$f":"VLOOKUP(A685,[2]Ledenlijst!$B$2:$N$707,7,FALSE)","v":"S"}]
[6743,{"$f":"VLOOKUP(A686,[2]Ledenlijst!$B$2:$N$707,2,FALSE)","v":"DE RUYTE Tom"},{"$f":"VLOOKUP(A686,[2]Ledenlijst!$B$2:$N$707,13,FALSE)","v":"KSNBA"},{"$f":"VLOOKUP(A686,[2]Ledenlijst!$B$2:$N$707,7,FALSE)","v":"S"}]
[4913,{"$f":"VLOOKUP(A687,[2]Ledenlijst!$B$2:$N$707,2,FALSE)","v":"DE RUYTE Yvan"},{"$f":"VLOOKUP(A687,[2]Ledenlijst!$B$2:$N$707,13,FALSE)","v":"KSNBA"},{"$f":"VLOOKUP(A687,[2]Ledenlijst!$B$2:$N$707,7,FALSE)","v":"S"}]
[4952,{"$f":"VLOOKUP(A688,[2]Ledenlijst!$B$2:$N$707,2,FALSE)","v":"DE SAEGER Dany"},{"$f":"VLOOKUP(A688,[2]Ledenlijst!$B$2:$N$707,13,FALSE)","v":"KSNBA"},{"$f":"VLOOKUP(A688,[2]Ledenlijst!$B$2:$N$707,7,FALSE)","v":"S"}]
[4916,{"$f":"VLOOKUP(A689,[2]Ledenlijst!$B$2:$N$707,2,FALSE)","v":"DE WITTE William"},{"$f":"VLOOKUP(A689,[2]Ledenlijst!$B$2:$N$707,13,FALSE)","v":"KSNBA"},{"$f":"VLOOKUP(A689,[2]Ledenlijst!$B$2:$N$707,7,FALSE)","v":"S"}]
[8149,{"$f":"VLOOKUP(A690,[2]Ledenlijst!$B$2:$N$707,2,FALSE)","v":"D'HONDT Roland"},{"$f":"VLOOKUP(A690,[2]Ledenlijst!$B$2:$N$707,13,FALSE)","v":"KSNBA"},{"$f":"VLOOKUP(A690,[2]Ledenlijst!$B$2:$N$707,7,FALSE)","v":"S"}]
["00699",{"$f":"VLOOKUP(A691,[2]Ledenlijst!$B$2:$N$707,2,FALSE)","v":"EGGHE Lutgarde"},{"$f":"VLOOKUP(A691,[2]Ledenlijst!$B$2:$N$707,13,FALSE)","v":"KSNBA"},null,null,{"$f":"VLOOKUP(A691,[2]Ledenlijst!$B$2:$N$707,7,FALSE)","v":"K"}]
[7704,{"$f":"VLOOKUP(A692,[2]Ledenlijst!$B$2:$N$707,2,FALSE)","v":"HEERWEGH Erik"},{"$f":"VLOOKUP(A692,[2]Ledenlijst!$B$2:$N$707,13,FALSE)","v":"KSNBA"},{"$f":"VLOOKUP(A692,[2]Ledenlijst!$B$2:$N$707,7,FALSE)","v":"S"}]
[4920,{"$f":"VLOOKUP(A693,[2]Ledenlijst!$B$2:$N$707,2,FALSE)","v":"HEERWEGH Robert"},{"$f":"VLOOKUP(A693,[2]Ledenlijst!$B$2:$N$707,13,FALSE)","v":"KSNBA"},{"$f":"VLOOKUP(A693,[2]Ledenlijst!$B$2:$N$707,7,FALSE)","v":"S"}]
[5732,{"$f":"VLOOKUP(A694,[2]Ledenlijst!$B$2:$N$707,2,FALSE)","v":"ILIANO Franz"},{"$f":"VLOOKUP(A694,[2]Ledenlijst!$B$2:$N$707,13,FALSE)","v":"KSNBA"},{"$f":"VLOOKUP(A694,[2]Ledenlijst!$B$2:$N$707,7,FALSE)","v":"S"}]
[4922,{"$f":"VLOOKUP(A695,[2]Ledenlijst!$B$2:$N$707,2,FALSE)","v":"LAUREYS Wilfried"},{"$f":"VLOOKUP(A695,[2]Ledenlijst!$B$2:$N$707,13,FALSE)","v":"KSNBA"},{"$f":"VLOOKUP(A695,[2]Ledenlijst!$B$2:$N$707,7,FALSE)","v":"S"}]
[1067,{"$f":"VLOOKUP(A696,[2]Ledenlijst!$B$2:$N$707,2,FALSE)","v":"MAES Bart"},{"$f":"VLOOKUP(A696,[2]Ledenlijst!$B$2:$N$707,13,FALSE)","v":"KSNBA"},{"$f":"VLOOKUP(A696,[2]Ledenlijst!$B$2:$N$707,7,FALSE)","v":"S"}]
[8903,{"$f":"VLOOKUP(A697,[2]Ledenlijst!$B$2:$N$707,2,FALSE)","v":"NEYTS Pierre"},{"$f":"VLOOKUP(A697,[2]Ledenlijst!$B$2:$N$707,13,FALSE)","v":"KSNBA"},{"$f":"VLOOKUP(A697,[2]Ledenlijst!$B$2:$N$707,7,FALSE)","v":"S"}]
["00309",{"$f":"VLOOKUP(A698,[2]Ledenlijst!$B$2:$N$707,2,FALSE)","v":"PRESENT Liesbeth"},{"$f":"VLOOKUP(A698,[2]Ledenlijst!$B$2:$N$707,13,FALSE)","v":"KSNBA"},null,null,{"$f":"VLOOKUP(A698,[2]Ledenlijst!$B$2:$N$707,7,FALSE)","v":"K"}]
[8081,{"$f":"VLOOKUP(A699,[2]Ledenlijst!$B$2:$N$707,2,FALSE)","v":"SLEEBUS Eddy"},{"$f":"VLOOKUP(A699,[2]Ledenlijst!$B$2:$N$707,13,FALSE)","v":"KSNBA"},{"$f":"VLOOKUP(A699,[2]Ledenlijst!$B$2:$N$707,7,FALSE)","v":"S"}]
["00874",{"$f":"VLOOKUP(A700,[2]Ledenlijst!$B$2:$N$707,2,FALSE)","v":"STEVENS Marie - Yvan"},{"$f":"VLOOKUP(A700,[2]Ledenlijst!$B$2:$N$707,13,FALSE)","v":"KSNBA"},null,null,{"$f":"VLOOKUP(A700,[2]Ledenlijst!$B$2:$N$707,7,FALSE)","v":"K"}]
[9083,{"$f":"VLOOKUP(A701,[2]Ledenlijst!$B$2:$N$707,2,FALSE)","v":"VAN DEN BERGHE André"},{"$f":"VLOOKUP(A701,[2]Ledenlijst!$B$2:$N$707,13,FALSE)","v":"KSNBA"},{"$f":"VLOOKUP(A701,[2]Ledenlijst!$B$2:$N$707,7,FALSE)","v":"S"}]
["5727C",{"$f":"VLOOKUP(A702,[2]Ledenlijst!$B$2:$N$707,2,FALSE)","v":"VAN GOETHEM Benny"},{"$f":"VLOOKUP(A702,[2]Ledenlijst!$B$2:$N$707,13,FALSE)","v":"KSNBA"},{"$f":"VLOOKUP(A702,[2]Ledenlijst!$B$2:$N$707,7,FALSE)","v":"S"}]
[9476,{"$f":"VLOOKUP(A703,[2]Ledenlijst!$B$2:$N$707,2,FALSE)","v":"VERHOFSTADT Eddy"},{"$f":"VLOOKUP(A703,[2]Ledenlijst!$B$2:$N$707,13,FALSE)","v":"KSNBA"},{"$f":"VLOOKUP(A703,[2]Ledenlijst!$B$2:$N$707,7,FALSE)","v":"S"},null,null,{"$f":"COUNTA(A679:A703)","v":25},null,"KSNBA"]
[9147,{"$f":"VLOOKUP(A704,[2]Ledenlijst!$B$2:$N$707,2,FALSE)","v":"BOCKLANDT Martin"},{"$f":"VLOOKUP(A704,[2]Ledenlijst!$B$2:$N$707,13,FALSE)","v":"QU"},{"$f":"VLOOKUP(A704,[2]Ledenlijst!$B$2:$N$707,7,FALSE)","v":"S"}]
[9278,{"$f":"VLOOKUP(A705,[2]Ledenlijst!$B$2:$N$707,2,FALSE)","v":"BOONE Koen"},{"$f":"VLOOKUP(A705,[2]Ledenlijst!$B$2:$N$707,13,FALSE)","v":"QU"},{"$f":"VLOOKUP(A705,[2]Ledenlijst!$B$2:$N$707,7,FALSE)","v":"S"}]
[9536,{"$f":"VLOOKUP(A706,[2]Ledenlijst!$B$2:$N$707,2,FALSE)","v":"BOONE Leo"},{"$f":"VLOOKUP(A706,[2]Ledenlijst!$B$2:$N$707,13,FALSE)","v":"QU"},{"$f":"VLOOKUP(A706,[2]Ledenlijst!$B$2:$N$707,7,FALSE)","v":"S"}]
[4945,{"$f":"VLOOKUP(A707,[2]Ledenlijst!$B$2:$N$707,2,FALSE)","v":"BUYLE Hubert"},{"$f":"VLOOKUP(A707,[2]Ledenlijst!$B$2:$N$707,13,FALSE)","v":"QU"},{"$f":"VLOOKUP(A707,[2]Ledenlijst!$B$2:$N$707,7,FALSE)","v":"S"}]
[7318,{"$f":"VLOOKUP(A708,[2]Ledenlijst!$B$2:$N$707,2,FALSE)","v":"CARDON Eric"},{"$f":"VLOOKUP(A708,[2]Ledenlijst!$B$2:$N$707,13,FALSE)","v":"QU"},{"$f":"VLOOKUP(A708,[2]Ledenlijst!$B$2:$N$707,7,FALSE)","v":"S"}]
[1329,{"$f":"VLOOKUP(A709,[2]Ledenlijst!$B$2:$N$707,2,FALSE)","v":"COENEN Philip"},{"$f":"VLOOKUP(A709,[2]Ledenlijst!$B$2:$N$707,13,FALSE)","v":"QU"},{"$f":"VLOOKUP(A709,[2]Ledenlijst!$B$2:$N$707,7,FALSE)","v":"S"}]
[4284,{"$f":"VLOOKUP(A710,[2]Ledenlijst!$B$2:$N$707,2,FALSE)","v":"DE BACKER Peter"},{"$f":"VLOOKUP(A710,[2]Ledenlijst!$B$2:$N$707,13,FALSE)","v":"QU"},{"$f":"VLOOKUP(A710,[2]Ledenlijst!$B$2:$N$707,7,FALSE)","v":"S"}]
[9445,{"$f":"VLOOKUP(A711,[2]Ledenlijst!$B$2:$N$707,2,FALSE)","v":"DE PAEPE Dirk"},{"$f":"VLOOKUP(A711,[2]Ledenlijst!$B$2:$N$707,13,FALSE)","v":"QU"},{"$f":"VLOOKUP(A711,[2]Ledenlijst!$B$2:$N$707,7,FALSE)","v":"S"}]
[9508,{"$f":"VLOOKUP(A712,[2]Ledenlijst!$B$2:$N$707,2,FALSE)","v":"HEYMAN David"},{"$f":"VLOOKUP(A712,[2]Ledenlijst!$B$2:$N$707,13,FALSE)","v":"QU"},{"$f":"VLOOKUP(A712,[2]Ledenlijst!$B$2:$N$707,7,FALSE)","v":"S"}]
[9535,{"$f":"VLOOKUP(A713,[2]Ledenlijst!$B$2:$N$707,2,FALSE)","v":"JORISSEN Jeffrey"},{"$f":"VLOOKUP(A713,[2]Ledenlijst!$B$2:$N$707,13,FALSE)","v":"QU"},{"$f":"VLOOKUP(A713,[2]Ledenlijst!$B$2:$N$707,7,FALSE)","v":"S"}]
["00817",{"$f":"VLOOKUP(A714,[2]Ledenlijst!$B$2:$N$707,2,FALSE)","v":"MATTENS Roger"},{"$f":"VLOOKUP(A714,[2]Ledenlijst!$B$2:$N$707,13,FALSE)","v":"QU"},null,null,{"$f":"VLOOKUP(A714,[2]Ledenlijst!$B$2:$N$707,7,FALSE)","v":"K"}]
[1204,{"$f":"VLOOKUP(A715,[2]Ledenlijst!$B$2:$N$707,2,FALSE)","v":"MERCKX Eddy"},{"$f":"VLOOKUP(A715,[2]Ledenlijst!$B$2:$N$707,13,FALSE)","v":"QU"},{"$f":"VLOOKUP(A715,[2]Ledenlijst!$B$2:$N$707,7,FALSE)","v":"S"}]
[4964,{"$f":"VLOOKUP(A716,[2]Ledenlijst!$B$2:$N$707,2,FALSE)","v":"RAEMDONCK Honoré"},{"$f":"VLOOKUP(A716,[2]Ledenlijst!$B$2:$N$707,13,FALSE)","v":"QU"},{"$f":"VLOOKUP(A716,[2]Ledenlijst!$B$2:$N$707,7,FALSE)","v":"S"}]
[6219,{"$f":"VLOOKUP(A717,[2]Ledenlijst!$B$2:$N$707,2,FALSE)","v":"RAEMDONCK Tommy"},{"$f":"VLOOKUP(A717,[2]Ledenlijst!$B$2:$N$707,13,FALSE)","v":"QU"},{"$f":"VLOOKUP(A717,[2]Ledenlijst!$B$2:$N$707,7,FALSE)","v":"S"}]
[8682,{"$f":"VLOOKUP(A718,[2]Ledenlijst!$B$2:$N$707,2,FALSE)","v":"TEMPELS André"},{"$f":"VLOOKUP(A718,[2]Ledenlijst!$B$2:$N$707,13,FALSE)","v":"QU"},{"$f":"VLOOKUP(A718,[2]Ledenlijst!$B$2:$N$707,7,FALSE)","v":"S"}]
[9970,{"$f":"VLOOKUP(A719,[2]Ledenlijst!$B$2:$N$707,2,FALSE)","v":"VAN GOETHEM Wim"},{"$f":"VLOOKUP(A719,[2]Ledenlijst!$B$2:$N$707,13,FALSE)","v":"QU"},{"$f":"VLOOKUP(A719,[2]Ledenlijst!$B$2:$N$707,7,FALSE)","v":"S"}]
[4334,{"$f":"VLOOKUP(A720,[2]Ledenlijst!$B$2:$N$707,2,FALSE)","v":"VAN HAUTE Guido"},{"$f":"VLOOKUP(A720,[2]Ledenlijst!$B$2:$N$707,13,FALSE)","v":"QU"},{"$f":"VLOOKUP(A720,[2]Ledenlijst!$B$2:$N$707,7,FALSE)","v":"S"}]
[4412,{"$f":"VLOOKUP(A721,[2]Ledenlijst!$B$2:$N$707,2,FALSE)","v":"VAN KERCKHOVE Freddy"},{"$f":"VLOOKUP(A721,[2]Ledenlijst!$B$2:$N$707,13,FALSE)","v":"QU"},{"$f":"VLOOKUP(A721,[2]Ledenlijst!$B$2:$N$707,7,FALSE)","v":"S"}]
[4977,{"$f":"VLOOKUP(A722,[2]Ledenlijst!$B$2:$N$707,2,FALSE)","v":"VLERICK Dirk"},{"$f":"VLOOKUP(A722,[2]Ledenlijst!$B$2:$N$707,13,FALSE)","v":"QU"},{"$f":"VLOOKUP(A722,[2]Ledenlijst!$B$2:$N$707,7,FALSE)","v":"S"}]
[7530,{"$f":"VLOOKUP(A723,[2]Ledenlijst!$B$2:$N$707,2,FALSE)","v":"VLERICK Mathieu"},{"$f":"VLOOKUP(A723,[2]Ledenlijst!$B$2:$N$707,13,FALSE)","v":"QU"},{"$f":"VLOOKUP(A723,[2]Ledenlijst!$B$2:$N$707,7,FALSE)","v":"S"},null,null,{"$f":"COUNTA(A704:A723)","v":20},null,"QU"]
[]
[null,null,{"$f":"COUNTA(C603:C723)","v":121},{"$f":"COUNTA(D603:D723)","v":95},{"$f":"COUNTA(E603:E723)","v":1},{"$f":"COUNTA(F603:F723)","v":25},null,{"$f":"SUM(G603:G724)","v":121},"Waasland"]
[]
[]
[]
[{"$f":"COUNTA(A3:A726)","v":705},null,null,{"$f":"SUM(D3:D728)","v":579},{"$f":"SUM(E3:E726)","v":8},{"$f":"SUM(F3:F726)","v":116},null,{"$f":"SUM(H3:H725)","v":704}]
[]
["Clubs",{"$f":"COUNTA(G3:G724)","v":36},null,"Senior ","Jeugd","Kl.Kaart",null,"Tot.Gewest"]
[]
[]
[]
[6966,"MESKENS Alain","VILV BC"]