{"text_format":"1","workbook":"xlsx","n_sheets":3,"sheets":["4°","4° zf","LEDEN"],"not_rendered":{"charts":0,"images":0,"macros":1,"external_links":2,"defined_names":6,"comments":0,"pivot_tables":0},"unopened":[],"bounds":{"document_bytes":16777216,"sheet_cells":100000,"rows_first":2000,"rows_last":500,"rows_between":2000,"halvings":0,"cell_chars":16384,"cell_head_chars":4096},"cells_cut":0,"cells_raw":0,"read":"whole","date_system":"1900"}

{"sheet":"4°","index":0,"n_rows":44,"n_cols":30,"rows_kept":44,"cut":false,"hidden":false,"merged":[[42,2,42,7],[36,2,36,10],[36,18,36,19],[37,2,37,10],[37,18,37,19],[38,1,38,10],[38,18,38,19],[33,2,33,10],[33,11,33,12],[34,2,34,10],[34,18,34,19],[35,2,35,10],[35,18,35,19],[29,2,29,10],[29,18,29,19],[30,2,30,10],[30,18,30,19],[31,1,31,10],[31,18,31,19],[26,2,26,10],[26,11,26,12],[27,2,27,10],[27,18,27,19],[28,2,28,10],[28,18,28,19],[22,2,22,10],[22,18,22,19],[23,2,23,10],[23,18,23,19],[24,1,24,10],[24,18,24,19],[19,2,19,10],[19,11,19,12],[20,2,20,10],[20,18,20,19],[21,2,21,10],[21,18,21,19],[15,2,15,10],[15,18,15,19],[16,2,16,10],[16,18,16,19],[17,1,17,10],[17,18,17,19],[12,2,12,10],[12,11,12,12],[13,2,13,10],[13,18,13,19],[14,2,14,10],[14,18,14,19],[5,0,5,20],[7,18,7,19],[8,1,8,2],[8,18,8,19],[10,2,10,10],[10,11,10,12],[10,18,10,19]]}
[]
["K O N I N K L I J K E   B E L G I S C H E    B I L J A R T B O N D ",null,null,null,null,null,null,null,null,null,null,null,"-","F E D E R A T I O N  R O Y A L E   B E L G E  DE  B I L L A R D "]
[null,null,null,null,"VZW - Zetel -  \" Café Sport \" - Martelarenplein, 13  -  3000 Leuven"]
[null,null,null,"GEWEST  BEIDE  VLAANDEREN"]
[null,null,null,null,null,null,null,null,null,null,"2017 - 2018"]
["UITSLAG GEWESTFINALE  :  4°  KLASSE   DRIEBANDEN  MB"]
[]
[null,"Inrichting : ",null,"KON. SINT-NIKLASE BA",null,null,null,null,null,null,null,null,null,null,null,null,null,"MIN","MAX"]
[null,"datum  : ",null,"zaterdag, 21 april 2018",null,null,null,null,null,null,null,null,null,null,18,null,null,0.33500000000000002,0.40500000000000003]
[null,null,null,null,null,null,null,null,null,null,null,null,null,null,null,null,null,null,null,null,null,null,null,null,null,null,null,null,null,"  "]
[null,"NATID","NAAM ",null,null,null,null,null,null,null,null,"CLUB",null,"WEDP","BP","Beurten","GEM 2,30","HR","OPM",null,"Pl",null,null,null,"rooster4","rooster 5","rooster 6","rooster7"]
[]
[null,7316,{"$f":"VLOOKUP(B13,LEDEN!A:B,2,FALSE)","v":"RONDELE Freddy"},null,null,null,null,null,null,null,null,{"$f":"VLOOKUP(B13,LEDEN!A:C,3,FALSE)","v":"WOH"},null,null,null,null,null,null,null,null,null,null,null,null,null,null,null,null," "]
[null,6399,{"$f":"VLOOKUP(B14,LEDEN!A:B,2,FALSE)","v":"DELAERE Marc"},null,null,null,null,null,null,null,null,null,null,2,18,39,{"$f":"IF(P14=0,\" \",TRUNC(O14/P14,3))","v":0.46100000000000002},3,{"$f":"IF(O14=0,\"\",IF(Q14>=X14,\"PR\",IF(Q14<W14,\"OG\",\"MG\")))","v":"PR"},null,null,null,0.33500000000000002,0.40400000000000003,"a1","a1","a1","a1",null,"  "]
[null,4922,{"$f":"VLOOKUP(B15,LEDEN!A:B,2,FALSE)","v":"LAUREYS Wilfried"},null,null,null,null,null,null,null,null,null,null,2,18,50,{"$f":"IF(P15=0,\" \",TRUNC(O15/P15,3))","v":0.36},3,{"$f":"IF(O15=0,\"\",IF(Q15>=X15,\"PR\",IF(Q15<W15,\"OG\",\"MG\")))","v":"MG"},null,null,null,0.33500000000000002,0.40400000000000003,"a2","a2","a6","a4"]
[null,1046,{"$f":"VLOOKUP(B16,LEDEN!A:B,2,FALSE)","v":"BRUGGEMAN Franky"},null,null,null,null,null,null,null,null,null,null,2,18,27,{"$f":"IF(P16=0,\" \",TRUNC(O16/P16,3))","v":0.66600000000000004},3,"PR",null,null,null,0.33500000000000002,0.40400000000000003,null,"a5","a3","a7"]
[null,null,{"$f":"VLOOKUP(B17,LEDEN!A:B,2,FALSE)","v":{"$error":"#N/A"}},null,null,null,null,null,null,null,null,null,null,null,null,null,{"$f":"IF(P17=0,\" \",TRUNC(O17/P17,2))","v":" "},null,"",null,null,null,0.33500000000000002,0.40400000000000003,null,"a3","a4","a5"]
[null,"EINDRESULTAAT",null,null,null,null,null,null,null,null,null,null,null,{"$f":"SUM(N14:N17)","v":6},{"$f":"SUM(O14:O17)","v":54},{"$f":"SUM(P14:P17)","v":116},{"$f":"IF(P18=0,\" \",TRUNC(O18/P18,3))","v":0.46500000000000002},3,{"$f":"IF(O18=0,\"\",IF(Q18>=X18,\"PR\",IF(Q18<W18,\"OG\",\"MG\")))","v":"PR"},null,1,null,0.33500000000000002,0.40400000000000003,null,"a4","a5","a6"]
[]
[null,1046,{"$f":"VLOOKUP(B20,LEDEN!A:B,2,FALSE)","v":"BRUGGEMAN Franky"},null,null,null,null,null,null,null,null,{"$f":"VLOOKUP(B20,LEDEN!A:C,3,FALSE)","v":"K.EBC"},null,null,null,null,null,null,null,null,null,null,null,null,"a2","a2","a2","a2"]
[null,4922,{"$f":"VLOOKUP(B21,LEDEN!A:B,2,FALSE)","v":"LAUREYS Wilfried"},null,null,null,null,null,null,null,null,null,null,2,18,41,{"$f":"IF(P21=0,\" \",TRUNC(O21/P21,3))","v":0.439},3,{"$f":"IF(O21=0,\"\",IF(Q21>=X21,\"PR\",IF(Q21<W21,\"OG\",\"MG\")))","v":"PR"},null,null,null,0.33500000000000002,0.40400000000000003,"a1","a1","a6","a5"]
[null,6399,{"$f":"VLOOKUP(B22,LEDEN!A:B,2,FALSE)","v":"DELAERE Marc"},null,null,null,null,null,null,null,null,null,null,2,18,42,{"$f":"IF(P22=0,\" \",TRUNC(O22/P22,3))","v":0.42799999999999999},3,{"$f":"IF(O22=0,\"\",IF(Q22>=X22,\"PR\",IF(Q22<W22,\"OG\",\"MG\")))","v":"PR"},null,null,null,0.33500000000000002,0.40400000000000003,null,"a4","a4","a7"]
[null,7316,{"$f":"VLOOKUP(B23,LEDEN!A:B,2,FALSE)","v":"RONDELE Freddy"},null,null,null,null,null,null,null,null,null,null,0,5,27,{"$f":"IF(P23=0,\" \",TRUNC(O23/P23,3))","v":0.185},2,"OG",null,null,null,0.33500000000000002,0.40400000000000003,null,"a5","a5","a4"]
[null,null,{"$f":"VLOOKUP(B24,LEDEN!A:B,2,FALSE)","v":{"$error":"#N/A"}},null,null,null,null,null,null,null,null,null,null,null,null,null,{"$f":"IF(P24=0,\" \",TRUNC(O24/P24,2))","v":" "},null,"",null,null,null,0.33500000000000002,0.40400000000000003,null,"a3","a3","a6"]
[null,"EINDRESULTAAT",null,null,null,null,null,null,null,null,null,null,null,{"$f":"SUM(N21:N24)","v":4},{"$f":"SUM(O21:O24)","v":41},{"$f":"SUM(P21:P24)","v":110},{"$f":"IF(P25=0,\" \",TRUNC(O25/P25,3))","v":0.372},{"$f":"MAX(R21:R24)","v":3},{"$f":"IF(O25=0,\"\",IF(Q25>=X25,\"PR\",IF(Q25<W25,\"OG\",\"MG\")))","v":"MG"},null,2,null,0.33500000000000002,0.40400000000000003]
[]
[null,4922,{"$f":"VLOOKUP(B27,LEDEN!A:B,2,FALSE)","v":"LAUREYS Wilfried"},null,null,null,null,null,null,null,null,{"$f":"VLOOKUP(B27,LEDEN!A:C,3,FALSE)","v":"KSNBA"},null,null,null,null,null,null,null,null,null,null,null,null,"a3","a3","a3","a3"]
[null,1046,{"$f":"VLOOKUP(B28,LEDEN!A:B,2,FALSE)","v":"BRUGGEMAN Franky"},null,null,null,null,null,null,null,null,null,null,0,4,41,{"$f":"IF(P28=0,\" \",TRUNC(O28/P28,3))","v":9.7000000000000003E-2},2,{"$f":"IF(O28=0,\"\",IF(Q28>=X28,\"PR\",IF(Q28<W28,\"OG\",\"MG\")))","v":"OG"},null,null,null,0.33500000000000002,0.40400000000000003,"a4","a4","a5","a4"]
[null,7316,{"$f":"VLOOKUP(B29,LEDEN!A:B,2,FALSE)","v":"RONDELE Freddy"},null,null,null,null,null,null,null,null,null,null,0,11,50,{"$f":"IF(P29=0,\" \",TRUNC(O29/P29,3))","v":0.22},2,{"$f":"IF(O29=0,\"\",IF(Q29>=X29,\"PR\",IF(Q29<W29,\"OG\",\"MG\")))","v":"OG"},null,null,null,0.33500000000000002,0.40400000000000003,null,"a5","a1","a6"]
[null,6399,{"$f":"VLOOKUP(B30,LEDEN!A:B,2,FALSE)","v":"DELAERE Marc"},null,null,null,null,null,null,null,null,null,null,0,10,34,{"$f":"IF(P30=0,\" \",TRUNC(O30/P30,3))","v":0.29399999999999998},2,"OG",null,null,null,0.33500000000000002,0.40400000000000003,null,"a1","a6","a7"]
{"$rows_left_out":15}
{"sheet":"4° zf","index":1,"n_rows":43,"n_cols":30,"rows_kept":43,"cut":false,"hidden":false,"merged":[[42,2,42,7],[36,2,36,10],[36,18,36,19],[37,2,37,10],[37,18,37,19],[38,1,38,10],[38,18,38,19],[33,2,33,10],[33,11,33,12],[34,2,34,10],[34,18,34,19],[35,2,35,10],[35,18,35,19],[29,2,29,10],[29,18,29,19],[30,2,30,10],[30,18,30,19],[31,1,31,10],[31,18,31,19],[26,2,26,10],[26,11,26,12],[27,2,27,10],[27,18,27,19],[28,2,28,10],[28,18,28,19],[22,2,22,10],[22,18,22,19],[23,2,23,10],[23,18,23,19],[24,1,24,10],[24,18,24,19],[19,2,19,10],[19,11,19,12],[20,2,20,10],[20,18,20,19],[21,2,21,10],[21,18,21,19],[15,2,15,10],[15,18,15,19],[16,2,16,10],[16,18,16,19],[17,1,17,10],[17,18,17,19],[12,2,12,10],[12,11,12,12],[13,2,13,10],[13,18,13,19],[14,2,14,10],[14,18,14,19],[5,0,5,20],[7,18,7,19],[8,1,8,2],[8,18,8,19],[10,2,10,10],[10,11,10,12],[10,18,10,19]]}
[]
["K O N I N K L I J K E   B E L G I S C H E    B I L J A R T B O N D ",null,null,null,null,null,null,null,null,null,null,null,"-","F E D E R A T I O N  R O Y A L E   B E L G E  DE  B I L L A R D "]
[null,null,null,null,"VZW - Zetel -  \" Café Sport \" - Martelarenplein, 13  -  3000 Leuven"]
[null,null,null,"GEWEST  BEIDE  VLAANDEREN"]
[null,null,null,null,null,null,null,null,null,null,"2017 - 2018"]
["UITSLAG GEWESTFINALE  :  4°  KLASSE   DRIEBANDEN  MB"]
[]
[null,"Inrichting : ",null,"KON. SINT-NIKLASE BA",null,null,null,null,null,null,null,null,null,null,null,null,null,"MIN","MAX"]
[null,"datum  : ",null,"zaterdag, 21 april 2018",null,null,null,null,null,null,null,null,null,null,18,null,null,0.33500000000000002,0.40500000000000003]
[null,null,null,null,null,null,null,null,null,null,null,null,null,null,null,null,null,null,null,null,null,null,null,null,null,null,null,null,null,"  "]
[null,"NATID","NAAM ",null,null,null,null,null,null,null,null,"CLUB",null,"WEDP","BP","Beurten","GEM 2,30","HR","OPM",null,"Pl",null,null,null,"rooster4","rooster 5","rooster 6","rooster7"]
[]
[null,7316,{"$f":"VLOOKUP(B13,LEDEN!A:B,2,FALSE)","v":"RONDELE Freddy"},null,null,null,null,null,null,null,null,{"$f":"VLOOKUP(B13,LEDEN!A:C,3,FALSE)","v":"WOH"},null,null,null,null,null,null,null,null,null,null,null,null,null,null,null,null," "]
[null,6399,{"$f":"VLOOKUP(B14,LEDEN!A:B,2,FALSE)","v":"DELAERE Marc"},null,null,null,null,null,null,null,null,null,null,null,null,null,{"$f":"IF(P14=0,\" \",TRUNC(O14/P14,2))","v":" "},null,{"$f":"IF(O14=0,\"\",IF(Q14>=X14,\"PR\",IF(Q14<W14,\"OG\",\"MG\")))","v":""},null,null,null,0.33500000000000002,0.40400000000000003,"a1","a1","a1","a1",null,"  "]
[null,null,null,null,null,null,null,null,null,null,null,null,null,null,null,null,{"$f":"IF(P15=0,\" \",TRUNC(O15/P15,2))","v":" "},null,{"$f":"IF(O15=0,\"\",IF(Q15>=X15,\"PR\",IF(Q15<W15,\"OG\",\"MG\")))","v":""},null,null,null,0.33500000000000002,0.40400000000000003,"a2","a2","a6","a4"]
[null,null,null,null,null,null,null,null,null,null,null,null,null,null,null,null," ",null,"",null,null,null,0.33500000000000002,0.40400000000000003,null,"a5","a3","a7"]
[null,null,{"$f":"VLOOKUP(B17,LEDEN!A:B,2,FALSE)","v":{"$error":"#N/A"}},null,null,null,null,null,null,null,null,null,null,null,null,null," ",null,"",null,null,null,0.33500000000000002,0.40400000000000003,null,"a3","a4","a5"]
[null,"EINDRESULTAAT",null,null,null,null,null,null,null,null,null,null,null,null,null,null,null,null,null,null,null,null,0.33500000000000002,0.40400000000000003,null,"a4","a5","a6"]
[]
[null,1046,{"$f":"VLOOKUP(B20,LEDEN!A:B,2,FALSE)","v":"BRUGGEMAN Franky"},null,null,null,null,null,null,null,null,{"$f":"VLOOKUP(B20,LEDEN!A:C,3,FALSE)","v":"K.EBC"},null,null,null,null,null,null,null,null,null,null,null,null,"a2","a2","a2","a2"]
[null,4922,{"$f":"VLOOKUP(B21,LEDEN!A:B,2,FALSE)","v":"LAUREYS Wilfried"},null,null,null,null,null,null,null,null,null,null,null,null,null,{"$f":"IF(P21=0,\" \",TRUNC(O21/P21,2))","v":" "},null,{"$f":"IF(O21=0,\"\",IF(Q21>=X21,\"PR\",IF(Q21<W21,\"OG\",\"MG\")))","v":""},null,null,null,0.33500000000000002,0.40400000000000003,"a1","a1","a6","a5"]
[null,null,null,null,null,null,null,null,null,null,null,null,null,null,null,null,{"$f":"IF(P22=0,\" \",TRUNC(O22/P22,2))","v":" "},null,{"$f":"IF(O22=0,\"\",IF(Q22>=X22,\"PR\",IF(Q22<W22,\"OG\",\"MG\")))","v":""},null,null,null,0.33500000000000002,0.40400000000000003,null,"a4","a4","a7"]
[null,null,null,null,null,null,null,null,null,null,null,null,null,null,null,null," ",null,"",null,null,null,0.33500000000000002,0.40400000000000003,null,"a5","a5","a4"]
[null,null,{"$f":"VLOOKUP(B24,LEDEN!A:B,2,FALSE)","v":{"$error":"#N/A"}},null,null,null,null,null,null,null,null,null,null,null,null,null," ",null,"",null,null,null,0.33500000000000002,0.40400000000000003,null,"a3","a3","a6"]
[null,"EINDRESULTAAT",null,null,null,null,null,null,null,null,null,null,null,null,null,null,null,null,null,null,null,null,0.33500000000000002,0.40400000000000003]
[]
[null,4922,{"$f":"VLOOKUP(B27,LEDEN!A:B,2,FALSE)","v":"LAUREYS Wilfried"},null,null,null,null,null,null,null,null,{"$f":"VLOOKUP(B27,LEDEN!A:C,3,FALSE)","v":"KSNBA"},null,null,null,null,null,null,null,null,null,null,null,null,"a3","a3","a3","a3"]
[null,1046,{"$f":"VLOOKUP(B28,LEDEN!A:B,2,FALSE)","v":"BRUGGEMAN Franky"},null,null,null,null,null,null,null,null,null,null,null,null,null,{"$f":"IF(P28=0,\" \",TRUNC(O28/P28,2))","v":" "},null,{"$f":"IF(O28=0,\"\",IF(Q28>=X28,\"PR\",IF(Q28<W28,\"OG\",\"MG\")))","v":""},null,null,null,0.33500000000000002,0.40400000000000003,"a4","a4","a5","a4"]
[null,null,null,null,null,null,null,null,null,null,null,null,null,null,null,null,{"$f":"IF(P29=0,\" \",TRUNC(O29/P29,2))","v":" "},null,{"$f":"IF(O29=0,\"\",IF(Q29>=X29,\"PR\",IF(Q29<W29,\"OG\",\"MG\")))","v":""},null,null,null,0.33500000000000002,0.40400000000000003,null,"a5","a1","a6"]
[null,null,null,null,null,null,null,null,null,null,null,null,null,null,null,null," ",null,"",null,null,null,0.33500000000000002,0.40400000000000003,null,"a1","a6","a7"]
{"$rows_left_out":14}
{"sheet":"LEDEN","index":2,"n_rows":735,"n_cols":9,"rows_kept":735,"cut":false,"hidden":false,"merged":[]}
["NATID","NAAM",null,"S","J","K","AANT/LED","TOT.DIST","2016-08-20"]
[]
[4100,{"$f":"VLOOKUP(A3,[2]Ledenlijst!$B$2:$N$707,2,FALSE)","v":"BOUSSY Werner"},{"$f":"VLOOKUP(A3,[2]Ledenlijst!$B$2:$N$707,13,FALSE)","v":"K.Kn"},{"$f":"VLOOKUP(A3,[2]Ledenlijst!$B$2:$N$707,7,FALSE)","v":"S"}]
[7678,{"$f":"VLOOKUP(A4,[2]Ledenlijst!$B$2:$N$707,2,FALSE)","v":"DE VREEZE Patrick"},{"$f":"VLOOKUP(A4,[2]Ledenlijst!$B$2:$N$707,13,FALSE)","v":"K.Kn"},{"$f":"VLOOKUP(A4,[2]Ledenlijst!$B$2:$N$707,7,FALSE)","v":"S"}]
[5178,{"$f":"VLOOKUP(A5,[2]Ledenlijst!$B$2:$N$707,2,FALSE)","v":"FRANKEN Luc"},{"$f":"VLOOKUP(A5,[2]Ledenlijst!$B$2:$N$707,13,FALSE)","v":"K.Kn"},{"$f":"VLOOKUP(A5,[2]Ledenlijst!$B$2:$N$707,7,FALSE)","v":"S"}]
[4522,{"$f":"VLOOKUP(A6,[2]Ledenlijst!$B$2:$N$707,2,FALSE)","v":"METTEPENNINGEN Julien"},{"$f":"VLOOKUP(A6,[2]Ledenlijst!$B$2:$N$707,13,FALSE)","v":"K.Kn"},{"$f":"VLOOKUP(A6,[2]Ledenlijst!$B$2:$N$707,7,FALSE)","v":"S"}]
[4114,{"$f":"VLOOKUP(A7,[2]Ledenlijst!$B$2:$N$707,2,FALSE)","v":"VAN KREIJ Jo"},{"$f":"VLOOKUP(A7,[2]Ledenlijst!$B$2:$N$707,13,FALSE)","v":"K.Kn"},{"$f":"VLOOKUP(A7,[2]Ledenlijst!$B$2:$N$707,7,FALSE)","v":"S"},null,null,{"$f":"COUNTA(A3:A7)","v":5},null,"K.Kn"]
[1102,{"$f":"VLOOKUP(A8,[2]Ledenlijst!$B$2:$N$707,2,FALSE)","v":"CALLIAUW Ludovicus"},{"$f":"VLOOKUP(A8,[2]Ledenlijst!$B$2:$N$707,13,FALSE)","v":"OS"},{"$f":"VLOOKUP(A8,[2]Ledenlijst!$B$2:$N$707,7,FALSE)","v":"S"}]
["00848",{"$f":"VLOOKUP(A9,[2]Ledenlijst!$B$2:$N$707,2,FALSE)","v":"DEVRIENDT Bart"},{"$f":"VLOOKUP(A9,[2]Ledenlijst!$B$2:$N$707,13,FALSE)","v":"OS"},null,null,{"$f":"VLOOKUP(A9,[2]Ledenlijst!$B$2:$N$707,7,FALSE)","v":"K"}]
[4119,{"$f":"VLOOKUP(A10,[2]Ledenlijst!$B$2:$N$707,2,FALSE)","v":"GEERLANDT José"},{"$f":"VLOOKUP(A10,[2]Ledenlijst!$B$2:$N$707,13,FALSE)","v":"OS"},{"$f":"VLOOKUP(A10,[2]Ledenlijst!$B$2:$N$707,7,FALSE)","v":"S"}]
[4122,{"$f":"VLOOKUP(A11,[2]Ledenlijst!$B$2:$N$707,2,FALSE)","v":"HAEGHEBAERT Eric"},{"$f":"VLOOKUP(A11,[2]Ledenlijst!$B$2:$N$707,13,FALSE)","v":"OS"},{"$f":"VLOOKUP(A11,[2]Ledenlijst!$B$2:$N$707,7,FALSE)","v":"S"}]
[6074,{"$f":"VLOOKUP(A12,[2]Ledenlijst!$B$2:$N$707,2,FALSE)","v":"MAES Hendrik"},{"$f":"VLOOKUP(A12,[2]Ledenlijst!$B$2:$N$707,13,FALSE)","v":"OS"},{"$f":"VLOOKUP(A12,[2]Ledenlijst!$B$2:$N$707,7,FALSE)","v":"S"}]
[7287,{"$f":"VLOOKUP(A13,[2]Ledenlijst!$B$2:$N$707,2,FALSE)","v":"SOENENS Joël"},{"$f":"VLOOKUP(A13,[2]Ledenlijst!$B$2:$N$707,13,FALSE)","v":"OS"},{"$f":"VLOOKUP(A13,[2]Ledenlijst!$B$2:$N$707,7,FALSE)","v":"S"}]
[8883,{"$f":"VLOOKUP(A14,[2]Ledenlijst!$B$2:$N$707,2,FALSE)","v":"VANPRAET Bart"},{"$f":"VLOOKUP(A14,[2]Ledenlijst!$B$2:$N$707,13,FALSE)","v":"OS"},{"$f":"VLOOKUP(A14,[2]Ledenlijst!$B$2:$N$707,7,FALSE)","v":"S"}]
[8668,{"$f":"VLOOKUP(A15,[2]Ledenlijst!$B$2:$N$707,2,FALSE)","v":"VANDEKEERE Bert"},{"$f":"VLOOKUP(A15,[2]Ledenlijst!$B$2:$N$707,13,FALSE)","v":"OS"},{"$f":"VLOOKUP(A15,[2]Ledenlijst!$B$2:$N$707,7,FALSE)","v":"S"}]
[7010,{"$f":"VLOOKUP(A16,[2]Ledenlijst!$B$2:$N$707,2,FALSE)","v":"VERMEULEN Johan"},{"$f":"VLOOKUP(A16,[2]Ledenlijst!$B$2:$N$707,13,FALSE)","v":"OS"},{"$f":"VLOOKUP(A16,[2]Ledenlijst!$B$2:$N$707,7,FALSE)","v":"S"}]
[4133,{"$f":"VLOOKUP(A17,[2]Ledenlijst!$B$2:$N$707,2,FALSE)","v":"WERBROUCK Luc"},{"$f":"VLOOKUP(A17,[2]Ledenlijst!$B$2:$N$707,13,FALSE)","v":"OS"},{"$f":"VLOOKUP(A17,[2]Ledenlijst!$B$2:$N$707,7,FALSE)","v":"S"},null,null,{"$f":"COUNTA(A8:A17)","v":10},null,"OS"]
[4158,{"$f":"VLOOKUP(A18,[2]Ledenlijst!$B$2:$N$707,2,FALSE)","v":"BAUWENS Freddy"},{"$f":"VLOOKUP(A18,[2]Ledenlijst!$B$2:$N$707,13,FALSE)","v":"K.ZE"},{"$f":"VLOOKUP(A18,[2]Ledenlijst!$B$2:$N$707,7,FALSE)","v":"S"}]
["00949",{"$f":"VLOOKUP(A19,[2]Ledenlijst!$B$2:$N$707,2,FALSE)","v":"BLOMME Johan"},{"$f":"VLOOKUP(A19,[2]Ledenlijst!$B$2:$N$707,13,FALSE)","v":"K.ZE"},null,null,{"$f":"VLOOKUP(A19,[2]Ledenlijst!$B$2:$N$707,7,FALSE)","v":"K"}]
["00850",{"$f":"VLOOKUP(A20,[2]Ledenlijst!$B$2:$N$707,2,FALSE)","v":"BONNY Ingrid"},{"$f":"VLOOKUP(A20,[2]Ledenlijst!$B$2:$N$707,13,FALSE)","v":"K.ZE"},null,null,{"$f":"VLOOKUP(A20,[2]Ledenlijst!$B$2:$N$707,7,FALSE)","v":"K"}]
["00852",{"$f":"VLOOKUP(A21,[2]Ledenlijst!$B$2:$N$707,2,FALSE)","v":"BULTINCK Ginette"},{"$f":"VLOOKUP(A21,[2]Ledenlijst!$B$2:$N$707,13,FALSE)","v":"K.ZE"},null,null,{"$f":"VLOOKUP(A21,[2]Ledenlijst!$B$2:$N$707,7,FALSE)","v":"K"}]
["KK",{"$f":"VLOOKUP(A22,[2]Ledenlijst!$B$2:$N$707,2,FALSE)","v":"BUYSSE Edgard"},{"$f":"VLOOKUP(A22,[2]Ledenlijst!$B$2:$N$707,13,FALSE)","v":"K.ZE"},null,null,{"$f":"VLOOKUP(A22,[2]Ledenlijst!$B$2:$N$707,7,FALSE)","v":"K"}]
[4162,{"$f":"VLOOKUP(A23,[2]Ledenlijst!$B$2:$N$707,2,FALSE)","v":"CAPPELLE Eddy"},{"$f":"VLOOKUP(A23,[2]Ledenlijst!$B$2:$N$707,13,FALSE)","v":"K.ZE"},{"$f":"VLOOKUP(A23,[2]Ledenlijst!$B$2:$N$707,7,FALSE)","v":"S"}]
["00853",{"$f":"VLOOKUP(A24,[2]Ledenlijst!$B$2:$N$707,2,FALSE)","v":"CATTRYSSE Magali"},{"$f":"VLOOKUP(A24,[2]Ledenlijst!$B$2:$N$707,13,FALSE)","v":"K.ZE"},null,null,{"$f":"VLOOKUP(A24,[2]Ledenlijst!$B$2:$N$707,7,FALSE)","v":"K"}]
[4167,{"$f":"VLOOKUP(A25,[2]Ledenlijst!$B$2:$N$707,2,FALSE)","v":"DECLERCK Gilbert"},{"$f":"VLOOKUP(A25,[2]Ledenlijst!$B$2:$N$707,13,FALSE)","v":"K.ZE"},{"$f":"VLOOKUP(A25,[2]Ledenlijst!$B$2:$N$707,7,FALSE)","v":"S"}]
[9254,{"$f":"VLOOKUP(A26,[2]Ledenlijst!$B$2:$N$707,2,FALSE)","v":"DEPRINCE Luc"},{"$f":"VLOOKUP(A26,[2]Ledenlijst!$B$2:$N$707,13,FALSE)","v":"K.ZE"},{"$f":"VLOOKUP(A26,[2]Ledenlijst!$B$2:$N$707,7,FALSE)","v":"S"}]
[4171,{"$f":"VLOOKUP(A27,[2]Ledenlijst!$B$2:$N$707,2,FALSE)","v":"FORREST Emiel"},{"$f":"VLOOKUP(A27,[2]Ledenlijst!$B$2:$N$707,13,FALSE)","v":"K.ZE"},{"$f":"VLOOKUP(A27,[2]Ledenlijst!$B$2:$N$707,7,FALSE)","v":"S"}]
["00854",{"$f":"VLOOKUP(A28,[2]Ledenlijst!$B$2:$N$707,2,FALSE)","v":"LAMBERT Marie-Thérése"},{"$f":"VLOOKUP(A28,[2]Ledenlijst!$B$2:$N$707,13,FALSE)","v":"K.ZE"},null,null,{"$f":"VLOOKUP(A28,[2]Ledenlijst!$B$2:$N$707,7,FALSE)","v":"K"}]
["00855",{"$f":"VLOOKUP(A29,[2]Ledenlijst!$B$2:$N$707,2,FALSE)","v":"MARTENS Linda"},{"$f":"VLOOKUP(A29,[2]Ledenlijst!$B$2:$N$707,13,FALSE)","v":"K.ZE"},null,null,{"$f":"VLOOKUP(A29,[2]Ledenlijst!$B$2:$N$707,7,FALSE)","v":"K"}]
["00856",{"$f":"VLOOKUP(A30,[2]Ledenlijst!$B$2:$N$707,2,FALSE)","v":"SEDED Bold"},{"$f":"VLOOKUP(A30,[2]Ledenlijst!$B$2:$N$707,13,FALSE)","v":"K.ZE"},null,null,{"$f":"VLOOKUP(A30,[2]Ledenlijst!$B$2:$N$707,7,FALSE)","v":"K"}]
{"$rows_left_out":705}